frost
has status: Published
type: Concept
alternative label: froid @fr
alternative label: cold
broader: natural hazard
definition: Température de l’air descendant durablement au-dessous de 0 °C bloquant la croissance et la photosynthèse. @fr
definition: Air temperature persistently dropping below 0 °C, blocking growth and photosynthesis.
in scheme: Thesaurus Multirisque FORESTT
narrower: early thaw
narrower: early frost
narrower: late frost
narrower: severe cold
preferred label: gel @fr
was quoted from: Adapté de EPHYTIA-INRAE. Froids-gelées. [En ligne]. [Consulté le 20/02/2026]. <URL : https://ephytia.inrae.fr/fr/C/18542/Forets-Froids-gelees>. @fr
was quoted from: Adapted from EPHYTIA-INRAE. Froids-gelées. [En ligne]. [Consulté le 20/02/2026]. <URL : https://ephytia.inrae.fr/fr/C/18542/Forets-Froids-gelees>.

forest-wild ungulate imbalance
has status: Published
type: Concept
broader: sensitivity related to silviculture
definition: Présence excessive d'ongulés sauvages, qui interdit tout renouvellement forestier dans des conditions techniques et économiques satisfaisantes. @fr
definition: Excessive presence of wild ungulates, preventing any forest renewal under satisfactory technical and economic conditions.
in scheme: Thesaurus Multirisque FORESTT
preferred label: déséquilibre forêt et ongulés sauvages @fr
was quoted from: Adapté de CNPF. Équilibre forêt-gibier (Équilibre sylvo-cynégétique). [En ligne]. Centre National de la Propriété Forestière, Gestion durable des forêts - Multifonctionnalité. [Consulté le 27/03/2026]. <URL : https://www.cnpf.fr/gestion-durable-des-forets/multifonctionnalite/equilibre-foret-gibier> @fr
was quoted from: Adapted from CNPF. Équilibre forêt-gibier (Équilibre sylvo-cynégétique). [En ligne]. Centre National de la Propriété Forestière, Gestion durable des forêts - Multifonctionnalité. [Consulté le 27/03/2026]. <URL : https://www.cnpf.fr/gestion-durable-des-forets/multifonctionnalite/equilibre-foret-gibier>

fuel break network
has status: Published
type: Concept
alternative label: compartmentalisation
alternative label: cloisonnement @fr
alternative label: forest compartmentalisation
alternative label: compartimentation de la forêt @fr
broader: silvicultural action
definition: All the cleared zones compartmentalising a given forest massif.
definition: Ensemble de zones débroussaillées compartimentant un massif forestier donné. @fr
in scheme: Thesaurus Multirisque FORESTT
preferred label: réseau de coupures de combustible @fr
was quoted from: Adapted from Rigolot (2002) Du plan départemental à la coupure de combustible. Guide méthodologique et pratique. Réseau Coupures de combustible n°6, 2002. [En ligne]. Éditions de la Cardère. [Consulté le 01/04/2026]. <URL : https://cardere.fr/doc/RCC6.pdf>
was quoted from: Adapté de Rigolot (2002) Du plan départemental à la coupure de combustible. Guide méthodologique et pratique. Réseau Coupures de combustible n°6, 2002. [En ligne]. Éditions de la Cardère. [Consulté le 01/04/2026]. <URL : https://cardere.fr/doc/RCC6.pdf> @fr

simultaneous risks
has status: Published
type: Concept
alternative label: concomitant risks
alternative label: risques concomitants @fr
broader: multiple risks
definition: Aléas s'exerçant en même temps sur un territoire donné et pouvant donner lieu à des évènements catastrophiques simultanés. @fr
definition: Hazards occurring at the same time in a given territory and potentially giving rise to simultaneous catastrophic events.
in scheme: Thesaurus Multirisque FORESTT
narrower: concurrence of hazards
preferred label: risques simultanés @fr
was quoted from: Adapté de Curt (2020) Multirisque : quelles orientations de recherche dans les travaux récents ? [En ligne]. [Consulté le 20/02/2026]. <URL : https://hal.science/hal-03462813/document>. @fr
was quoted from: Adapted from Curt (2020) Multirisque : quelles orientations de recherche dans les travaux récents ? [En ligne]. [Consulté le 20/02/2026]. <URL : https://hal.science/hal-03462813/document>.

uprooting of seedlings/plants
has status: Published
type: Concept
alternative label: fouillage de litière @fr
alternative label: litter foraging
broader: mechanical destruction
definition: Arrachage avec ou sans consommation de semis ou de plants forestiers par des grands ongulés @fr
definition: Uprooting, with or without consumption, of forest seedlings or plants by large ungulates.
in scheme: Thesaurus Multirisque FORESTT
preferred label: arrachage de semis/plants @fr
was quoted from: Adapté de Plateforme Nationale Forêt-Gibier. Outil national de signalement des dégâts de gibier (GIP ATGeRi). [En ligne]. [Consulté le 25/03/2026]. <URL : https://share.google/CiDSrtD59AcdrA7Fy> @fr
was quoted from: Adapted from Plateforme Nationale Forêt-Gibier. Outil national de signalement des dégâts de gibier (GIP ATGeRi). [En ligne]. [Consulté le 25/03/2026]. <URL : https://share.google/CiDSrtD59AcdrA7Fy>

fine root loss
has status: Published
type: Concept
broader: damage characterisation
definition: Diminution de la biomasse racinaire fine due à la sécheresse. @fr
definition: Decrease in fine root biomass due to drought.
in scheme: Thesaurus Multirisque FORESTT
preferred label: perte de racines fines @fr
was quoted from: Groupe de travail « Thésaurus du multirisque en forêt » du projet X-RISKS du PEPR FORESTT (ANR-24-PEFO-0005). [En ligne]. <URL : https://www.pepr-forestt.fr/projets/pc-x-risks> @fr

leaf miner
has status: Published
type: Concept
broader: foliage pest insect
definition: Larva digging galleries within the thickness of leaves.
definition: Larve creusant des galeries dans l’épaisseur des feuilles. @fr
in scheme: Thesaurus Multirisque FORESTT
preferred label: mineuse @fr
was quoted from: Adapted from Gerbeaud. Mineuse. [En ligne]. [Consulté le 20/02/2026]. <URL : https://www.gerbeaud.com/jardin/fiches/mineuse.php>.
was quoted from: Adapté de Gerbeaud. Mineuse. [En ligne]. [Consulté le 20/02/2026]. <URL : https://www.gerbeaud.com/jardin/fiches/mineuse.php>. @fr

genotype mixing
has status: Published
type: Concept
broader: prevention through genetics
definition: Gestion forestière visant à assembler des arbres de constitutions génétiques variées pour augmenter la résistance du peuplement mélangé face aux risques biotiques et abiotiques. @fr
definition: Forest management aimed at assembling trees of varied genetic makeup to increase the resistance of the mixed stand to biotic and abiotic risks.
in scheme: Thesaurus Multirisque FORESTT
narrower: genotype mixing through planting
narrower: genotype mixing favoured by silviculture
preferred label: mélange de génotypes @fr
was quoted from: Adapté de RNCan - Service canadien des forêts. Glossaire forestier : Sylviculture intensive. [En ligne]. 2019. [Consulté le 25/03/2026]. <URL : https://scf.rncan.gc.ca/termes/vue/642> @fr
was quoted from: Adapted from RNCan - Service canadien des forêts. Glossaire forestier : Sylviculture intensive. [En ligne]. 2019. [Consulté le 25/03/2026]. <URL : https://scf.rncan.gc.ca/termes/vue/642>

response to protect the company
has status: Published
type: Concept
broader: response to protect the wood sector
definition: Action aimed either at eliminating the risk to the forestry company by removing its cause, or at reducing it by decreasing its probability of occurrence or its impact on the company by acting on the hazard, vulnerability or exposure of the company, or at transferring it to a third party.
definition: Action visant soit à supprimer le risque pour l'entreprise forestière en éliminant la cause, soit à le réduire en diminuant sa probabilité d’occurrence ou son impact sur l'entreprise en agissant sur l'aléa, la vulnérabilité ou l'exposition de l'entreprise, soit à le transférer vers un tiers. @fr
in scheme: Thesaurus Multirisque FORESTT
narrower: diversify the company's supply sources
narrower: diversify the company's markets
narrower: increase the company's cash flow
preferred label: réponse pour protéger l'entreprise @fr
was quoted from: Adapté de FAO. Agrovoc : gestion du risque. [En ligne]. FAO. [Consulté le 07/04/2026]. <URL : https://agrovoc.fao.org/browse/agrovoc/fr/page/c_37934> @fr
was quoted from: Adapted from FAO. Agrovoc : gestion du risque. [En ligne]. FAO. [Consulté le 07/04/2026]. <URL : https://agrovoc.fao.org/browse/agrovoc/fr/page/c_37934>

deterrent signals
has status: Published
type: Concept
broader: curative management, direct control
definition: Dispositifs repoussant les grands ongulés pour protéger les arbres. @fr
definition: Devices deterring large ungulates to protect trees.
in scheme: Thesaurus Multirisque FORESTT
narrower: auditory signals
narrower: olfactory signals
preferred label: signaux dissuasifs @fr
was quoted from: Groupe de travail « Thésaurus du multirisque en forêt » du projet X-RISKS du PEPR FORESTT (ANR-24-PEFO-0005). [En ligne]. <URL : https://www.pepr-forestt.fr/projets/pc-x-risks> @fr

critical infrastructure
has status: Published
type: Concept
broader: non-forest asset at risk
definition: Système, installation ou actif essentiel au fonctionnement de la société et de l’économie, exposée directement ou indirectement à un aléa de la forêt. @fr
definition: System, facility or asset essential to the functioning of society and the economy, directly or indirectly exposed to a forest hazard.
in scheme: Thesaurus Multirisque FORESTT
preferred label: infrastructure critique @fr
was quoted from: Adapté de European Commission. (2008). COUNCIL DIRECTIVE 2008/114/EC of 8 December 2008 on the identification and designation of European critical infrastructures and the assessment of the need to improve their protection. Official Journal of the European Union. @fr
was quoted from: Adapted from European Commission. (2008). COUNCIL DIRECTIVE 2008/114/EC of 8 December 2008 on the identification and designation of European critical infrastructures and the assessment of the need to improve their protection. Official Journal of the European Union.

loss of supporting ecosystem service
has status: Published
type: Concept
broader: damage characterisation
definition: Reduction in the supporting service provided by forest ecosystems, such as soil formation or primary production.
definition: Réduction du service de soutien fourni par les écosystèmes forestiers tel que la formation des sols ou la production primaire. @fr
in scheme: Thesaurus Multirisque FORESTT
narrower: biodiversity erosion
preferred label: perte de service écosystémique de soutien @fr
was quoted from: Adapté de Millennium Ecosystem Assessment (2005) Ecosystems and Human Well-being. En ligne]. Millennium Ecosystem Assessment. [Consulté le 01/04/2026]. <URL : https://www.millenniumassessment.org/documents/document.765.aspx.pdf> @fr
was quoted from: Adapted from Millennium Ecosystem Assessment (2005) Ecosystems and Human Well-being. En ligne]. Millennium Ecosystem Assessment. [Consulté le 01/04/2026]. <URL : https://www.millenniumassessment.org/documents/document.765.aspx.pdf>

loss for the wood sector
has status: Published
type: Concept
broader: exposed asset of the wood sector
definition: Préjudice ou perte pour la filière bois, observé ou prédit, lié à la réalisation ou à la projection des impacts causés par un aléa. @fr
definition: Observed or predicted harm or loss to the wood sector, linked to the occurrence or projection of impacts caused by a hazard.
in scheme: Thesaurus Multirisque FORESTT
narrower: economic loss
preferred label: perte de la filière bois @fr
was quoted from: Adapté de GIEC (2018) Glossaire. [En ligne]. Genève, GIEC. [Consulté le 20/02/2026]. <URL : https://www.ipcc.ch/site/assets/uploads/sites/2/2019/10/SR15_Glossary_french.pdf>. @fr
was quoted from: Adapted from GIEC (2018) Glossaire. [En ligne]. Genève, GIEC. [Consulté le 20/02/2026]. <URL : https://www.ipcc.ch/site/assets/uploads/sites/2/2019/10/SR15_Glossary_french.pdf>.

curative management, direct control
has status: Published
type: Concept
alternative label: lutte curative @fr
alternative label: réponse @fr
alternative label: curative control
alternative label: response
broader: forest management for risk adaptation and management
in scheme: Thesaurus Multirisque FORESTT
narrower: biological control
narrower: curative silvicultural action
narrower: rewilding
narrower: deterrent signals
narrower: open habitat management
narrower: insecticide treatment
narrower: containment
narrower: road safety clearance
narrower: semiochemical treatment
narrower: eradication
narrower: physical protection
narrower: regulation of ungulate populations
narrower: tactical firebreak
narrower: ground intervention
narrower: aerial intervention
preferred label: gestion curative, lutte directe @fr

forest, agricultural land and vegetation fire
has status: Published
type: Concept
broader: natural hazard
definition: Combustion qui se propage de manière incontrôlée dans le temps et dans l'espace et qui touche une forêt, une formation subforestière ou un espace agricole,et sur au moins 0,5 ha, où les végétaux y sont partiellement ou totalement détruits. @fr
definition: Combustion that spreads uncontrollably over time and space and affects a forest, a sub-forest formation or agricultural land, over at least 0.5 ha, where vegetation is partially or totally destroyed.
in scheme: Thesaurus Multirisque FORESTT
narrower: zombie fire
narrower: extreme wildfire
preferred label: incendie de forêt, de surfaces agricoles et de végétation @fr
was quoted from: Adapté de Observatoire des forêts françaises. Description du phénomène. [En ligne]. [Consulté le 20/02/2026]. <URL : https://observatoire.foret.gouv.fr/themes/description-du-phenomene>. @fr
was quoted from: Adapted from Observatoire des forêts françaises. Description du phénomène. [En ligne]. [Consulté le 20/02/2026]. <URL : https://observatoire.foret.gouv.fr/themes/description-du-phenomene>.

plant pathogen
has status: Published
type: Concept
alternative label: phytopathogènes @fr
alternative label: phytopathogens
broader: plant bioagressor
definition: Agent (vivant ou non) causant l’altération des fonctions normales de la plante ou d’une partie de celle-ci. Les principaux agents sont la pollution, les animaux, les champignons et d’autres plantes @fr
definition: Agent (living or not) causing the alteration of the normal functions of a plant or part of it. The main agents are pollution, animals, fungi and other plants.
in scheme: Thesaurus Multirisque FORESTT
narrower: fungal phytopathogenic agent
narrower: non-fungal phytopathogenic agent
narrower: vascular pathogen
preferred label: agent pathogène des végétaux @fr

unmanageable nature of crisis timber for the wood sector
has status: Published
type: Concept
broader: inability to manage crisis timber
definition: Characteristics of crisis timber making its management and utilisation difficult.
definition: Caractéristiques des bois de crise rendant leur gestion et leur valorisation difficile. @fr
in scheme: Thesaurus Multirisque FORESTT
preferred label: nature du bois de crise ingérable par la filière bois @fr
was quoted from: Adapté de Ayphassorho et al. (2025) Valorisation des bois de crise et résilience de la filière forêt-bois : Vers une culture du risque. Rapport CGAAER n° 24073 - IGEDD n° 015817-01. IGEDD / CGAAER, 2025, 166 p. [En ligne]. [Consulté le 25/03/2026]. <URL : https://www.igedd.developpement-durable.gouv.fr/IMG/pdf/015817-01_rapport_publie_cle5431ce.pdf> @fr
was quoted from: Adapted from Ayphassorho et al. (2025) Valorisation des bois de crise et résilience de la filière forêt-bois : Vers une culture du risque. Rapport CGAAER n° 24073 - IGEDD n° 015817-01. IGEDD / CGAAER, 2025, 166 p. [En ligne]. [Consulté le 25/03/2026]. <URL : https://www.igedd.developpement-durable.gouv.fr/IMG/pdf/015817-01_rapport_publie_cle5431ce.pdf>

loss of crisis memory
has status: Published
type: Concept
broader: lack of risk culture
definition: Vulnérabilité de la filière forêt-bois liée à l'oubli progressif des crises passées et de leurs enseignements par les acteurs du secteur en particulier, et par la société en général. @fr
definition: Vulnerability of the forest-wood sector related to the gradual forgetting of past crises and their lessons by sector actors in particular, and by society in general.
in scheme: Thesaurus Multirisque FORESTT
preferred label: perte de la mémoire des crises @fr
was quoted from: Adapté de Géoconfluences. Glossaire : Mémoire du risque. 2025. [En ligne]. ENS de Lyon. [Consulté le 07/04/2026]. <URL : https://geoconfluences.ens-lyon.fr/glossaire/memoire-du-risque> @fr
was quoted from: Adapted from Géoconfluences. Glossaire : Mémoire du risque. 2025. [En ligne]. ENS de Lyon. [Consulté le 07/04/2026]. <URL : https://geoconfluences.ens-lyon.fr/glossaire/memoire-du-risque>

risk interdependence
has status: Published
type: Concept
alternative label: dépendance des risques @fr
alternative label: risques interdépendants @fr
alternative label: risques dépendants @fr
alternative label: risk dependence
alternative label: interdependent risks
alternative label: dependent risks
broader: multi-risk approach
definition: Liens de dépendance entre différents risques ou entre leur composantes. @fr
definition: Dependency links between different risks or between their components.
in scheme: Thesaurus Multirisque FORESTT
preferred label: interdépendance des risques @fr
was quoted from: Groupe de travail « Thésaurus du multirisque en forêt » du projet X-RISKS du PEPR FORESTT (ANR-24-PEFO-0005). [En ligne]. <URL : https://www.pepr-forestt.fr/projets/pc-x-risks> @fr

conservation biological control
has status: Published
type: Concept
broader: biological control
definition: Method of controlling harmful organisms in the forest, consisting of using a mix of tree species to favour natural enemies.
definition: Méthode de lutte contre les organismes nuisibles en forêt consistant à utiliser le mélange d'essences d'arbres pour favoriser les auxiliaires naturels. @fr
in scheme: Thesaurus Multirisque FORESTT
preferred label: lutte biologique par conservation @fr
was quoted from: Adapted from Dictionnaire d’agroécologie. Lutte biologique par conservation. [En ligne]. [Consulté le 25/03/2026]. <URL : https://dicoagroecologie.fr/dictionnaire/lutte-biologique-par-conservation/>
was quoted from: Adapté de Dictionnaire d’agroécologie. Lutte biologique par conservation. [En ligne]. [Consulté le 25/03/2026]. <URL : https://dicoagroecologie.fr/dictionnaire/lutte-biologique-par-conservation/> @fr

spatial scope of risk measurement
has status: Published
type: Concept
broader: spatio-temporal framework of risk measurement
definition: Definition of the geographic scope covered by the analysis of the system of interest subject to risk.
definition: Définition du périmètre géographique sur lequel porte l'analyse du système d'intérêt soumis au risque. @fr
in scheme: Thesaurus Multirisque FORESTT
preferred label: périmètre spatial de la mesure du risque @fr
was quoted from: Groupe de travail « Thésaurus du multirisque en forêt » du projet X-RISKS du PEPR FORESTT (ANR-24-PEFO-0005). [En ligne]. <URL : https://www.pepr-forestt.fr/projets/pc-x-risks> @fr

shallow tree rooting depth
has status: Published
type: Concept
broader: species-specific sensitivity
definition: Enracinement superficiel réduisant la stabilité face aux vents. @fr
definition: Shallow rooting reducing stability against wind.
in scheme: Thesaurus Multirisque FORESTT
preferred label: faible profondeur d’enracinement des arbres @fr
was quoted from: Adapté de Danjon et al. Le rôle du sol et de l’ancrage racinaire. Soil, roots and anchorage of forest trees. [En ligne]. INRAE - SILVA Nancy. [Consulté le 25/03/2026]. <URL : https://silva.nancy.hub.inrae.fr/content/download/664/5564?version=1> @fr
was quoted from: Adapted from Danjon et al. Le rôle du sol et de l’ancrage racinaire. Soil, roots and anchorage of forest trees. [En ligne]. INRAE - SILVA Nancy. [Consulté le 25/03/2026]. <URL : https://silva.nancy.hub.inrae.fr/content/download/664/5564?version=1>

damage
has status: Published
type: Concept
alternative label: dégât @fr
alternative label: perte @fr
alternative label: loss
broader: asset at risk
definition: Préjudice ou perte, observé ou prédit, lié à la réalisation ou à la projection des impacts causés par un aléa. @fr
definition: Observed or predicted harm or loss linked to the occurrence or projection of impacts caused by a hazard.
in scheme: Thesaurus Multirisque FORESTT
preferred label: dommage @fr
was quoted from: Adapté de GIEC (2018) Glossaire. [En ligne]. Genève, GIEC. [Consulté le 20/02/2026]. <URL : https://www.ipcc.ch/site/assets/uploads/sites/2/2019/10/SR15_Glossary_french.pdf>. @fr
was quoted from: Adapted from GIEC (2018) Glossaire. [En ligne]. Genève, GIEC. [Consulté le 20/02/2026]. <URL : https://www.ipcc.ch/site/assets/uploads/sites/2/2019/10/SR15_Glossary_french.pdf>.

trunk pathogen
has status: Published
type: Concept
broader: fungal phytopathogenic agent
definition: Fungal organism attacking the trunk of a tree.
definition: Organisme fongique s’attaquant au tronc d’un arbre. @fr
in scheme: Thesaurus Multirisque FORESTT
preferred label: agent pathogène du tronc @fr
was quoted from: Groupe de travail « Thésaurus du multirisque en forêt » du projet X-RISKS du PEPR FORESTT (ANR-24-PEFO-0005). [En ligne]. <URL : https://www.pepr-forestt.fr/projets/pc-x-risks> @fr

range expansion
has status: Published
type: Concept
alternative label: spread of invasive species
alternative label: invasion
alternative label: propagation d'espèces envahissantes @fr
broader: hazard characterisation
definition: Colonisation of new environments by an invasive pathogen.
definition: Colonisation de nouveaux milieux par un agent pathogène envahissant. @fr
in scheme: Thesaurus Multirisque FORESTT
preferred label: expansion de l’aire de répartition @fr
was quoted from: Adapted from INRAE. Changement climatique : de nouvelles perspectives dans la dynamique d’expansion de la chenille processionnaire du pin. [En ligne]. 08 août 2025. [Consulté le 25/03/2026]. <URL : https://www.inrae.fr/actualites/changement-climatique-nouvelles-perspectives-dynamique-dexpansion-chenille-processionnaire-du-pin>
was quoted from: Adapté de INRAE. Changement climatique : de nouvelles perspectives dans la dynamique d’expansion de la chenille processionnaire du pin. [En ligne]. 08 août 2025. [Consulté le 25/03/2026]. <URL : https://www.inrae.fr/actualites/changement-climatique-nouvelles-perspectives-dynamique-dexpansion-chenille-processionnaire-du-pin> @fr

cash flow difficulty for forestry work companies
has status: Published
type: Concept
broader: vulnerability of forestry work companies
definition: Vulnérabilité des entreprises de travaux forestiers liée à des difficultés de trésorerie. @fr
definition: Vulnerability of forestry work companies related to cash flow difficulties.
in scheme: Thesaurus Multirisque FORESTT
preferred label: difficulté de trésorerie des entreprises de travaux forestiers @fr
was quoted from: Groupe de travail « Thésaurus du multirisque en forêt » du projet X-RISKS du PEPR FORESTT (ANR-24-PEFO-0005). [En ligne]. <URL : https://www.pepr-forestt.fr/projets/pc-x-risks> @fr

qualitative risk assessment
has status: Published
type: Concept
broader: risk assessment
definition: Approche qualitative d'estimation des risques. @fr
definition: Qualitative approach to risk estimation.
in scheme: Thesaurus Multirisque FORESTT
narrower: worst-case risk
narrower: severe risk
narrower: extreme risk
narrower: extreme event
narrower: catastrophic event
narrower: black swan event
narrower: tipping point
preferred label: évaluation qualitative du risque @fr
was quoted from: Adapté de UNDRR. "Disaster risk assessment". Sendai Framework Terminology on Disaster Risk Reduction. [En ligne]. United Nations Office for Disaster Risk Reduction. [Consulté le 03/06/2026]. <URL : https://www.undrr.org/terminology/disaster-risk-assessment> @fr
was quoted from: Adapted from UNDRR. "Disaster risk assessment". Sendai Framework Terminology on Disaster Risk Reduction. [En ligne]. United Nations Office for Disaster Risk Reduction. [Consulté le 03/06/2026]. <URL : https://www.undrr.org/terminology/disaster-risk-assessment>

DFCI service
has status: Published
type: Concept
broader: governance measure
definition: Service de l'Etat ou des collectivités territoriales contribuant à la défense des forêts contre l’incendie. @fr
definition: State or local authority service contributing to forest fire defence.
in scheme: Thesaurus Multirisque FORESTT
preferred label: service dfci @fr
was quoted from: Adapté de Observatoire des forêts françaises. Les acteurs de la prévention et de la lutte. [En ligne]. [Consulté le 25/03/2026]. <URL : https://observatoire.foret.gouv.fr/themes/les-acteurs-de-la-prevention-et-de-la-lutte> @fr
was quoted from: Adapted from Observatoire des forêts françaises. Les acteurs de la prévention et de la lutte. [En ligne]. [Consulté le 25/03/2026]. <URL : https://observatoire.foret.gouv.fr/themes/les-acteurs-de-la-prevention-et-de-la-lutte>

governance measure
has status: Published
type: Concept
broader: response to protect the forest
definition: Formal and informal rules, organisations and processes through which public and private forestry actors articulate their interests, make and implement their decisions.
definition: Règles formelles et informelles, organisations et processus à travers lesquels les acteurs publics et privés de la forêt articulent leurs intérêts, prennent et appliquent leurs décisions. @fr
in scheme: Thesaurus Multirisque FORESTT
narrower: ONF mountain land restoration service (RTM)
narrower: protection forest
narrower: protection forest mapping
narrower: DFCI service
narrower: forest fire hazard mapping
narrower: diversification of land use at massif scale
narrower: flood zone mapping
preferred label: mesure de gouvernance @fr
was quoted from: Adapted from FAO. [En ligne]. Rome, FAO. [Consulté le 20/02/2026]. <URL : https://www.fao.org/sustainable-forest-management/toolbox/modules-alternative/forest-governance/basic-knowledge/fr/>.
was quoted from: Adapté de FAO. [En ligne]. Rome, FAO. [Consulté le 20/02/2026]. <URL : https://www.fao.org/sustainable-forest-management/toolbox/modules-alternative/forest-governance/basic-knowledge/fr/>. @fr

loss of wood quality
has status: Published
type: Concept
alternative label: wood downgrading
alternative label: déclassement du bois @fr
broader: damage characterisation
definition: Aesthetic or mechanical depreciation of wood.
definition: Dépréciation esthétique ou mécanique du bois. @fr
in scheme: Thesaurus Multirisque FORESTT
narrower: wood blue stain
preferred label: perte de qualité du bois @fr
was quoted from: Adapted from RNCan - Service canadien des forêts. Glossaire forestier : Sylviculture intensive. [En ligne]. 2019. [Consulté le 25/03/2026]. <URL : https://scf.rncan.gc.ca/termes/vue/72>
was quoted from: Adapté de RNCan - Service canadien des forêts. Glossaire forestier : Sylviculture intensive. [En ligne]. 2019. [Consulté le 25/03/2026]. <URL : https://scf.rncan.gc.ca/termes/vue/72> @fr

intense hail
has status: Published
type: Concept
broader: hail
definition: Précipitation de grêle causant des dommages mécaniques sur les organes aériens des plantes. @fr
definition: Hail precipitation causing mechanical damage to the aerial parts of plants.
in scheme: Thesaurus Multirisque FORESTT
preferred label: grêle intense @fr
was quoted from: Adapté de EPHYTIA-INRAE. Fortes pluies, grêle. [En ligne]. [Consulté le 20/02/2026]. <URL : https://ephytia.inrae.fr/fr/c/18545/Fortes pluies, grêle>. @fr
was quoted from: Adapted from EPHYTIA-INRAE. Fortes pluies, grêle. [En ligne]. [Consulté le 20/02/2026]. <URL : https://ephytia.inrae.fr/fr/c/18545/Fortes pluies, grêle>.

contaminated tree
has status: Published
type: Concept
alternative label: arbre infecté @fr
alternative label: infected tree
broader: damage characterisation
definition: Tree carrying a pathogen or parasite.
definition: Arbre portant un pathogène ou parasite. @fr
in scheme: Thesaurus Multirisque FORESTT
preferred label: arbre contaminé @fr
was quoted from: Adapté de Plan national d'intervention sanitaire d'urgence relatif à Bursaphelenchus xylophilus (nématode du pin). [En ligne]. [Consulté le 20/02/2026]. <URL : https://info.agriculture.gouv.fr/boagri/instruction-2019-209>. @fr
was quoted from: Adapted from Plan national d'intervention sanitaire d'urgence relatif à Bursaphelenchus xylophilus (nématode du pin). [En ligne]. [Consulté le 20/02/2026]. <URL : https://info.agriculture.gouv.fr/boagri/instruction-2019-209>.

socio-economic profile of the owner
has status: Published
type: Concept
broader: vulnerability of owners
definition: Vulnérabilité liée au profil socio-économique des propriétaires forestiers. @fr
definition: Vulnerability related to the socio-economic profile of forest owners.
in scheme: Thesaurus Multirisque FORESTT
narrower: low asset diversification of owners
narrower: lack of support from homeowners
preferred label: profil socio-économique du propriétaire @fr
was quoted from: Groupe de travail « Thésaurus du multirisque en forêt » du projet X-RISKS du PEPR FORESTT (ANR-24-PEFO-0005). [En ligne]. <URL : https://www.pepr-forestt.fr/projets/pc-x-risks> @fr

stand age
has status: Published
type: Concept
broader: sensitivity related to forest structure
definition: Average age of the dominant and codominant trees in a stand.
definition: Âge moyen des arbres dominants et codominants d'un peuplement. @fr
in scheme: Thesaurus Multirisque FORESTT
narrower: aged stand
preferred label: âge du peuplement @fr
was quoted from: Adapted from OQLF. Grand dictionnaire terminologique : âge d'un peuplement. 2015. [En ligne]. Office québécois de la langue française. [Consulté le 07/04/2026]. <URL : https://vitrinelinguistique.oqlf.gouv.qc.ca/fiche-gdt/fiche/26531715/age-dun-peuplement>
was quoted from: Adapté de OQLF. Grand dictionnaire terminologique : âge d'un peuplement. 2015. [En ligne]. Office québécois de la langue française. [Consulté le 07/04/2026]. <URL : https://vitrinelinguistique.oqlf.gouv.qc.ca/fiche-gdt/fiche/26531715/age-dun-peuplement> @fr

multi-risk assessment method
has status: Published
type: Concept
alternative label: mesure @fr
alternative label: measure
broader: multi-risk approach
definition: Method for assessing multi-risk.
definition: Méthode d’évaluation du multirisque. @fr
in scheme: Thesaurus Multirisque FORESTT
narrower: multi-risk measure
narrower: aggregated risk measure
narrower: commensurable risks
narrower: non-commensurable risks
preferred label: mesure multirisque @fr
was quoted from: Groupe de travail « Thésaurus du multirisque en forêt » du projet X-RISKS du PEPR FORESTT (ANR-24-PEFO-0005). [En ligne]. <URL : https://www.pepr-forestt.fr/projets/pc-x-risks> @fr

thinning
has status: Published
type: Concept
alternative label: crown spacing
alternative label: mise à distance des houppiers @fr
alternative label: reducing leaf area
alternative label: limiter la surface foliaire @fr
broader: silvicultural action
definition: Partial cutting carried out in a stand, traditionally intended to accelerate the growth of remaining trees, but also to space out crowns to prevent crown fires, and to increase the availability of water, nutrients and light for the remaining trees. The increased windthrow risk immediately after thinning decreases over a few years as the canopy closes and the stem and root system grow.
definition: Coupe partielle pratiquée dans un peuplement, destinée classiquement à accélérer la croissance des arbres résiduels, mais aussi espacer les houppiers pour éviter les feux de cime, et augmenter la disponibilité en eau, en nutriments et en lumière pour les arbres résiduels. L'augmentation du risque de chablis immédiatement après l'éclaircie, diminue en quelques années via la fermeture du couvert et la croissance de la tige et du système racinaire. @fr
in scheme: Thesaurus Multirisque FORESTT
narrower: heavy thinning
preferred label: éclaircie @fr
was quoted from: Adapted from RNCan - Service canadien des forêts. Glossaire forestier : Sylviculture intensive. [En ligne]. 2019. [Consulté le 25/03/2026]. <URL : https://scf.rncan.gc.ca/termes/vue/1174>
was quoted from: Adapté de RNCan - Service canadien des forêts. Glossaire forestier : Sylviculture intensive. [En ligne]. 2019. [Consulté le 25/03/2026]. <URL : https://scf.rncan.gc.ca/termes/vue/1174> @fr

parasitic plant
has status: Published
type: Concept
broader: non-fungal phytopathogenic agent
definition: Plante qui se nourrit au détriment d'une plante hôte sans que cette dernière tire avantage de cette association, bien qu'elle ne soit généralement pas tuée. @fr
definition: Plant that feeds at the expense of a host plant without the latter benefiting from this association, although it is generally not killed.
in scheme: Thesaurus Multirisque FORESTT
preferred label: plante parasite @fr
was quoted from: Adapté de SCF RNCan. Termes. [En ligne]. Ottawa, SCF RNCan. [Consulté le 20/02/2026]. <URL : https://scf.rncan.gc.ca/termes>. @fr
was quoted from: Adapted from SCF RNCan. Termes. [En ligne]. Ottawa, SCF RNCan. [Consulté le 20/02/2026]. <URL : https://scf.rncan.gc.ca/termes>.

tipping point
has status: Published
type: Concept
broader: qualitative risk assessment
definition: Degré de changement des propriétés d’un système au-delà duquel le système en question se réorganise, souvent de façon abrupte, et ne retrouve pas son état initial même si les facteurs du changement sont éliminés. @fr
definition: Degree of change in the properties of a system beyond which the system in question reorganises itself, often abruptly, and does not return to its original state even if the drivers of change are removed.
in scheme: Thesaurus Multirisque FORESTT
narrower: reference hazard
preferred label: point de basculement @fr
was quoted from: GIEC. (2018). Glossaire. [En ligne]. Genève, GIEC. [Consulté le 20/02/2026]. <URL : https://www.ipcc.ch/site/assets/uploads/sites/2/2019/10/SR15_Glossary_french.pdf>. @fr

crisis timber management
has status: Published
type: Concept
alternative label: récoltes de bois @fr
alternative label: crisis timber harvesting
broader: curative silvicultural action
definition: Organisation de la récolte, du stockage et de la valorisation des bois de crise. @fr
definition: Organisation of the harvesting, storage and utilisation of crisis timber.
in scheme: Thesaurus Multirisque FORESTT
narrower: crisis timber storage
preferred label: gestion des bois de crise @fr
was quoted from: Adapté de Ayphassorho et al. (2025) Valorisation des bois de crise et résilience de la filière forêt-bois : Vers une culture du risque. Rapport CGAAER n° 24073 – IGEDD n° 015817-01. IGEDD / CGAAER, 2025, 166 p. [En ligne]. [Consulté le 25/03/2026]. <URL : https://www.igedd.developpement-durable.gouv.fr/IMG/pdf/015817-01_rapport_publie_cle5431ce.pdf> @fr
was quoted from: Adapted from Ayphassorho et al. (2025) Valorisation des bois de crise et résilience de la filière forêt-bois : Vers une culture du risque. Rapport CGAAER n° 24073 – IGEDD n° 015817-01. IGEDD / CGAAER, 2025, 166 p. [En ligne]. [Consulté le 25/03/2026]. <URL : https://www.igedd.developpement-durable.gouv.fr/IMG/pdf/015817-01_rapport_publie_cle5431ce.pdf>

sensitivity related to phenology
has status: Published
type: Concept
broader: climate-related forest sensitivity
definition: Extent to which a forest species is affected by a hazard due to its phenology.
definition: Mesure dans laquelle une espèce forestière est affectée par un aléa du fait de sa phénologie. @fr
in scheme: Thesaurus Multirisque FORESTT
narrower: sensitivity related to root phenology
narrower: sensitivity related to cambial phenology
narrower: sensitivity related to sugar management
narrower: sensitivity related to nitrogen management
narrower: sensitivity related to leaf phenology
preferred label: sensibilité liée aux phénologies @fr
was quoted from: Adapté de TEMPO. Observatoire Forêts. [En ligne]. TEMPO (Réseau national d’observation de la phénologie). [Consulté le 25/03/2026]. <URL : https://tempo.pheno.fr/observatoires/observatoire-forets> @fr
was quoted from: Adapted from TEMPO. Observatoire Forêts. [En ligne]. TEMPO (Réseau national d’observation de la phénologie). [Consulté le 25/03/2026]. <URL : https://tempo.pheno.fr/observatoires/observatoire-forets>

urbanisation
has status: Published
type: Concept
broader: sensitivity to large-scale human actions
definition: Processus, continu depuis la première industrialisation, de croissance de la population urbaine et d'extension des villes. @fr
definition: Process, continuous since the first industrialisation, of growth in the urban population and expansion of cities.
in scheme: Thesaurus Multirisque FORESTT
narrower: land fragmentation
was quoted from: Adapté de Géoconfluences. Urbanisation. [En ligne]. ENS Lyon. [Consulté le 03/06/2026]. <URL : https://geoconfluences.ens-lyon.fr/glossaire/urbanisation-1> @fr
was quoted from: Adapted from Géoconfluences. Urbanisation. [En ligne]. ENS Lyon. [Consulté le 03/06/2026]. <URL : https://geoconfluences.ens-lyon.fr/glossaire/urbanisation-1>

rodent
has status: Published
type: Concept
broader: plant bioagressor
definition: Mammifère de l’ordre Rodentia avec une mâchoire possédant des incisives, mais pas de canines. @fr
definition: Mammal of the order Rodentia with a jaw bearing incisors but no canines.
in scheme: Thesaurus Multirisque FORESTT
narrower: small rodent
narrower: large rodent
preferred label: rongeur @fr
was quoted from: Aquaportail. Rongeur. [En ligne]. [Consulté le 20/02/2026]. <URL : https://www.aquaportail.com/dictionnaire/definition/3166/rongeur>. @fr

regulatory classification of forests
has status: Published
type: Concept
broader: regulatory measure
definition: Disposition prévue par le code forestier pour édicter des mesures spécifiques aux bois et forêts classées à « risque d'incendie ". @fr
definition: Provision under the Forest Code to enact specific measures for woodlands and forests classified as "fire risk".
in scheme: Thesaurus Multirisque FORESTT
preferred label: classement réglementaire des forêts @fr
was quoted from: Adapté de Observatoire des forêts françaises. Les outils de prévention législatifs et réglementaires. 2024. [En ligne]. Observatoire des forêts françaises. [Consulté le 01/04/2026]. <URL : https://observatoire.foret.gouv.fr/themes/les-outils-de-prevention-legislatifs-et-reglementaires> @fr
was quoted from: Adapted from Observatoire des forêts françaises. Les outils de prévention législatifs et réglementaires. 2024. [En ligne]. Observatoire des forêts françaises. [Consulté le 01/04/2026]. <URL : https://observatoire.foret.gouv.fr/themes/les-outils-de-prevention-legislatifs-et-reglementaires>

genetic sensitivity of stand components
has status: Published
type: Concept
broader: forest sensitivity
definition: Sensibilité à un aléa liée au génotype de la plante. @fr
definition: Sensitivity to a hazard related to the plant's genotype.
in scheme: Thesaurus Multirisque FORESTT
preferred label: sensibilité génétique des composantes du peuplement @fr
was quoted from: Groupe de travail « Thésaurus du multirisque en forêt » du projet X-RISKS du PEPR FORESTT (ANR-24-PEFO-0005). [En ligne]. <URL : https://www.pepr-forestt.fr/projets/pc-x-risks> @fr

cumulative damage
has status: Published
type: Concept
broader: multiple risks
definition: Sum of losses linked to (observed) impacts or (projected) risks in a given area over a given period.
definition: Somme des pertes liés aux impacts (observés) ou aux risques (projetés) sur une zone données pendant une péridoe donnée. @fr
in scheme: Thesaurus Multirisque FORESTT
preferred label: dommages cumulés @fr
was quoted from: Groupe de travail « Thésaurus du multirisque en forêt » du projet X-RISKS du PEPR FORESTT (ANR-24-PEFO-0005). [En ligne]. <URL : https://www.pepr-forestt.fr/projets/pc-x-risks> @fr

diversify the company's supply sources
has status: Published
type: Concept
broader: response to protect the company
definition: Multiply the wood supply sources of the forestry company.
definition: Multiplier les sources d’approvisionnement en bois de l'entreprise forestière. @fr
in scheme: Thesaurus Multirisque FORESTT
preferred label: diversifier les approvisionnements de l'entreprise @fr
was quoted from: Adapted from Wernsdörfer & Lenglet (2021) Ressources forestières et filière bois (RFF). 2021. [En ligne]. AgroParisTech. [Consulté le 07/04/2026]. <URL : https://www.agroparistech.fr/sites/default/files/media/2022-07/da-rff-2021-10-27.pdf>
was quoted from: Adapté de Wernsdörfer & Lenglet (2021) Ressources forestières et filière bois (RFF). 2021. [En ligne]. AgroParisTech. [Consulté le 07/04/2026]. <URL : https://www.agroparistech.fr/sites/default/files/media/2022-07/da-rff-2021-10-27.pdf> @fr

weakening of owners' savings
has status: Published
type: Concept
broader: vulnerability of owners
definition: Vulnérabilité liée à une érosion de l’épargne des propriétaires forestiers. @fr
definition: Vulnerability related to an erosion of forest owners' savings.
in scheme: Thesaurus Multirisque FORESTT
preferred label: fragilisation de l'épargne des propriétaires @fr
was quoted from: Groupe de travail « Thésaurus du multirisque en forêt » du projet X-RISKS du PEPR FORESTT (ANR-24-PEFO-0005). [En ligne]. <URL : https://www.pepr-forestt.fr/projets/pc-x-risks> @fr

prevention
has status: Published
type: Concept
alternative label: gestion préventive @fr
alternative label: preventive management
broader: forest management for risk adaptation and management
definition: Phase du cycle de gestion de crise en forêt où sont réalisées des actions de réduction du risque visant à atténuer les aléas, l'exposition ou la vulnérabilité des enjeux. @fr
definition: Phase of the forest crisis management cycle in which risk-reduction actions are carried out, aimed at mitigating hazards, or the exposure or vulnerability of assets.
in scheme: Thesaurus Multirisque FORESTT
narrower: preventive silviculture
narrower: forest planning for risk adaptation and management
narrower: adapt forest infrastructure
preferred label: prévention @fr

extreme wildfire
has status: Published
type: Concept
alternative label: événement extrême d'incendie @fr
alternative label: feu hors norme @fr
alternative label: méga-feu @fr
alternative label: incendie de forêt catastrophique @fr
alternative label: extreme fire event
alternative label: off-the-scale fire
alternative label: megafire
alternative label: catastrophic forest fire
broader: forest, agricultural land and vegetation fire
definition: Incendie de forêt dont la surface finaler dépasse 10 000 ha. @fr
definition: Forest fire whose final burnt area exceeds 10,000 ha.
in scheme: Thesaurus Multirisque FORESTT
preferred label: feu extrême @fr
was quoted from: Adapté de Tedim et al. (2018). Defining Extreme Wildfire Events: Difficulties, Challenges, and Impacts. Fire, 1(1), 9. [En ligne]. [Consulté le 03/06/2026]. <URL : https://doi.org/10.3390/fire1010009> @fr
was quoted from: Adapted from Tedim et al. (2018). Defining Extreme Wildfire Events: Difficulties, Challenges, and Impacts. Fire, 1(1), 9. [En ligne]. [Consulté le 03/06/2026]. <URL : https://doi.org/10.3390/fire1010009>

high combustibility
has status: Published
type: Concept
broader: sensitivity related to forest structure
definition: Forte propension d'un combustible à s'enflammer et à brûler. @fr
definition: High propensity of a fuel to ignite and burn.
in scheme: Thesaurus Multirisque FORESTT
narrower: low moisture content
narrower: high fuel biomass
narrower: fine, dry leaf
narrower: presence of flammable compounds
preferred label: forte combustibilité @fr
was quoted from: Adapté de Revertegat et al. (2025) Synthèse sur la vulnérabilité des peuplements forestiers au feu. Rapport final du projet AFORCE VULNEFEU (Vulnefeu04). [En ligne]. Réseau AFORCE, 2025. [Consulté le 25/03/2026]. <URL : https://www.reseau-aforce.fr/sites/reseau-aforce/files/2025-07/Rapport-Vulnefeu04-compressed.pdf @fr
was quoted from: Adapted from Revertegat et al. (2025) Synthèse sur la vulnérabilité des peuplements forestiers au feu. Rapport final du projet AFORCE VULNEFEU (Vulnefeu04). [En ligne]. Réseau AFORCE, 2025. [Consulté le 25/03/2026]. <URL : https://www.reseau-aforce.fr/sites/reseau-aforce/files/2025-07/Rapport-Vulnefeu04-compressed.pdf

setting hunting pressure levels to apply
has status: Published
type: Concept
broader: regulatory measure
definition: Détermination des niveaux de prélèvement de gibier pour maintenir l'équilibre forêt-gibier. @fr
definition: Determination of game harvest levels to maintain the forest-wildlife balance.
in scheme: Thesaurus Multirisque FORESTT
preferred label: définition des niveaux de pression de chasse à appliquer @fr
was quoted from: Adapté de Équilibre Forêt Gibier. Rétablir l’équilibre forêt-gibier : une démarche en 3 étapes. [En ligne]. Projet Équilibre Forêt Gibier. [Consulté le 25/03/2026]. <URL : https://equilibre-foret-gibier.fr/retablir-lequilibre-foret-gibier-une-demarche-en-3-etapes/> @fr
was quoted from: Adapted from Équilibre Forêt Gibier. Rétablir l’équilibre forêt-gibier : une démarche en 3 étapes. [En ligne]. Projet Équilibre Forêt Gibier. [Consulté le 25/03/2026]. <URL : https://equilibre-foret-gibier.fr/retablir-lequilibre-foret-gibier-une-demarche-en-3-etapes/>

reproductive organ pest insect
has status: Published
type: Concept
broader: pest insect
definition: Insecte se nourrissant de graines ou des cônes. @fr
definition: Insect feeding on seeds or cones.
in scheme: Thesaurus Multirisque FORESTT
narrower: seed-feeding insect
preferred label: insecte ravageur des organes reproducteurs @fr
was quoted from: Adapté de Bouget et al. (2005) Nomenclature des groupes écologiques d’insectes liés au bois. [En ligne]. Paris, Comptes Rendus Biologies. [Consulté le 20/02/2026]. <URL : https://doi.org/10.1016/j.crvi.2005.08.003>. @fr
was quoted from: Adapted from Bouget et al. (2005) Nomenclature des groupes écologiques d’insectes liés au bois. [En ligne]. Paris, Comptes Rendus Biologies. [Consulté le 20/02/2026]. <URL : https://doi.org/10.1016/j.crvi.2005.08.003>.

rely on natural regeneration or seeding
has status: Published
type: Concept
broader: silvicultural action
definition: Favoriser le renouvellement naturel d’un peuplement forestier par voie de semences, par des rejets, par drageonnement ou par marcottage. @fr
definition: Promote the natural renewal of a forest stand through seeding, suckering, root sprouting or layering.
in scheme: Thesaurus Multirisque FORESTT
preferred label: miser sur la régénération naturelle ou l'ensemmencement @fr
was quoted from: Adapté de RNCan - Service canadien des forêts. Glossaire forestier : Sylviculture intensive. [En ligne]. 2019. [Consulté le 25/03/2026]. <URL : https://scf.rncan.gc.ca/termes/vue/805> @fr
was quoted from: Adapted from RNCan - Service canadien des forêts. Glossaire forestier : Sylviculture intensive. [En ligne]. 2019. [Consulté le 25/03/2026]. <URL : https://scf.rncan.gc.ca/termes/vue/805>

dependence on markets for processing actors
has status: Published
type: Concept
broader: vulnerability of processing actors
definition: Vulnerability of forest processing actors related to their excessive dependence on specific markets.
definition: Vulnérabilité des acteurs de la transformation forestière liée à leur trop forte dépendance à des marchés spécifiques. @fr
in scheme: Thesaurus Multirisque FORESTT
preferred label: dépendance aux débouchés des acteurs de la transformation @fr
was quoted from: Groupe de travail « Thésaurus du multirisque en forêt » du projet X-RISKS du PEPR FORESTT (ANR-24-PEFO-0005). [En ligne]. <URL : https://www.pepr-forestt.fr/projets/pc-x-risks> @fr

individual factor
has status: Published
type: Concept
broader: lack of adaptive capacity
definition: Caractéristique propre à un arbre augmentant sa vulnérabilité. @fr
definition: Characteristic specific to a tree that increases its vulnerability.
in scheme: Thesaurus Multirisque FORESTT
narrower: low wound-healing capacity
narrower: low tree elasticity
narrower: shallow root exploration depth
preferred label: facteur individuel @fr
was quoted from: Groupe de travail « Thésaurus du multirisque en forêt » du projet X-RISKS du PEPR FORESTT (ANR-24-PEFO-0005). [En ligne]. <URL : https://www.pepr-forestt.fr/projets/pc-x-risks> @fr

decline in financial support
has status: Published
type: Concept
broader: economic hazard
definition: Réduction des aides publiques aux acteurs de la filière forêt-bois. @fr
definition: Reduction in public aid to forest-wood sector actors.
in scheme: Thesaurus Multirisque FORESTT
preferred label: baisse des soutiens financiers @fr
was quoted from: Adapté de Forestopic. Le bois énergie réorienté par la programmation pluriannuelle de l'énergie. [En ligne]. Forestopic. [Consulté le 07/04/2026]. <URL : https://www.forestopic.com/fr/yes-i-wood/bois-energie/2002-bois-energie-reoriente-par-programmation-pluriannuelle-energie?highlight=WyJhaWRlcyIsImFpZGUiLCJhaWRcdTAwZTlzIiwiYWlkZXIiLCJhaWRlcmFpZW50IiwiYWlkYW50IiwiYWlkXHUwMGU5IiwiYWlkZXJhaXQiLCJhaWRcdTAwZTllcyIsImFpZFx1MDBlOWUiXQ==> @fr
was quoted from: Adapted from Forestopic. Le bois énergie réorienté par la programmation pluriannuelle de l'énergie. [En ligne]. Forestopic. [Consulté le 07/04/2026]. <URL : https://www.forestopic.com/fr/yes-i-wood/bois-energie/2002-bois-energie-reoriente-par-programmation-pluriannuelle-energie?highlight=WyJhaWRlcyIsImFpZGUiLCJhaWRcdTAwZTlzIiwiYWlkZXIiLCJhaWRlcmFpZW50IiwiYWlkYW50IiwiYWlkXHUwMGU5IiwiYWlkZXJhaXQiLCJhaWRcdTAwZTllcyIsImFpZFx1MDBlOWUiXQ==>

cambium-feeding insect
has status: Published
type: Concept
broader: wood-boring insect
definition: Insecte se nourrissant de la zone cambiale. @fr
definition: Insect feeding on the cambial zone.
in scheme: Thesaurus Multirisque FORESTT
preferred label: insecte cambiophage @fr
was quoted from: Adapté de Bouget et al. (2005) Nomenclature des groupes écologiques d’insectes liés au bois. [En ligne]. Paris, Comptes Rendus Biologies. [Consulté le 20/02/2026]. <URL : https://doi.org/10.1016/j.crvi.2005.08.003>. @fr
was quoted from: Adapted from Bouget et al. (2005) Nomenclature des groupes écologiques d’insectes liés au bois. [En ligne]. Paris, Comptes Rendus Biologies. [Consulté le 20/02/2026]. <URL : https://doi.org/10.1016/j.crvi.2005.08.003>.

auditory signals
has status: Published
type: Concept
broader: deterrent signals
definition: Sound devices deterring large ungulates to protect trees.
definition: Dispositifs sonores repoussant les grands ongulés pour protéger les arbres. @fr
in scheme: Thesaurus Multirisque FORESTT
preferred label: signaux auditifs @fr
was quoted from: Groupe de travail « Thésaurus du multirisque en forêt » du projet X-RISKS du PEPR FORESTT (ANR-24-PEFO-0005). [En ligne]. <URL : https://www.pepr-forestt.fr/projets/pc-x-risks> @fr

loss of provisioning service
has status: Published
type: Concept
broader: damage characterisation
definition: Réduction du service d'approvisionnement fourni par les écosystèmes forestiers tel que la fourniture en bois, en fibre ou en combustible. @fr
definition: Reduction in the provisioning service provided by forest ecosystems, such as the supply of wood, fibre or fuel.
in scheme: Thesaurus Multirisque FORESTT
narrower: loss of wood supply
narrower: loss of genetic material supply
narrower: loss of non-wood product supply
preferred label: perte de service d'approvisionnement @fr
was quoted from: Adapté de Millennium Ecosystem Assessment (2005) Chapitre 1 - Cadre conceptuel du MA (Messages principaux). In : Écosystèmes et bien-être humain : Un cadre pour l’évaluation. 2003 (ou 2005 selon l’édition). [En ligne]. [Consulté le 25/03/2026]. <URL : https://www.millenniumassessment.org/documents/document.765.aspx.pdf> @fr
was quoted from: Adapted from Millennium Ecosystem Assessment (2005) Chapitre 1 - Cadre conceptuel du MA (Messages principaux). In : Écosystèmes et bien-être humain : Un cadre pour l’évaluation. 2003 (ou 2005 selon l’édition). [En ligne]. [Consulté le 25/03/2026]. <URL : https://www.millenniumassessment.org/documents/document.765.aspx.pdf>

damage frequency
has status: Published
type: Concept
broader: damage characterisation
definition: Nombre d’occurrences de dommages sur une période. @fr
definition: Number of occurrences of damage over a period.
in scheme: Thesaurus Multirisque FORESTT
preferred label: fréquence des dommages @fr
was quoted from: Groupe de travail « Thésaurus du multirisque en forêt » du projet X-RISKS du PEPR FORESTT (ANR-24-PEFO-0005). [En ligne]. <URL : https://www.pepr-forestt.fr/projets/pc-x-risks> @fr

social hazard
has status: Published
type: Concept
broader: hazard threatening the wood industry
definition: Possibilité d'une remise en cause du lien forêt - société. @fr
definition: Possibility of a challenge to the forest-society relationship.
in scheme: Thesaurus Multirisque FORESTT
narrower: rise in societal tensions
preferred label: aléa social @fr
was quoted from: Adapté de WWF France. Enchantées ou désenchantées : quelles forêts françaises en 2100 ? 2025. [En ligne]. WWF. [Consulté le 07/04/2026]. <URL : https://www.wwf.fr/sites/default/files/doc-2025-03/FORETS%20ENCHANTE%CC%81ES%20FINAL%20BASSE%20DEF.pdf> @fr
was quoted from: Adapted from WWF France. Enchantées ou désenchantées : quelles forêts françaises en 2100 ? 2025. [En ligne]. WWF. [Consulté le 07/04/2026]. <URL : https://www.wwf.fr/sites/default/files/doc-2025-03/FORETS%20ENCHANTE%CC%81ES%20FINAL%20BASSE%20DEF.pdf>

derecho
type: Concept
broader: violent wind
definition: Complex of thunderstorms extending over more than 100 km, characterised by the production, at the leading edge, of violent downdraft winds exceeding 90 km/h over a wide area.
definition: Complexe d'orages s'étendant sur plus de 100 km et caractérisé par la production au niveau du front de rafales descendantes de vent violent, supérieures à 90 km/h, sur une zone étendue. @fr
in scheme: Thesaurus Multirisque FORESTT
preferred label: derechos @fr
was quoted from: Groupe de travail « Thésaurus du multirisque en forêt » du projet X-RISKS du PEPR FORESTT (ANR-24-PEFO-0005). [En ligne]. <URL : https://www.pepr-forestt.fr/projets/pc-x-risks> @fr

insecticide trap
has status: Published
type: Concept
broader: use of attractants
definition: Dispositif de capture passive qui utilise un insecticide comme agent létal afin de tuer et conserver les insectes attirés ou interceptés par le piège. @fr
definition: Passive capture device using an insecticide as a lethal agent to kill and preserve insects attracted or intercepted by the trap.
in scheme: Thesaurus Multirisque FORESTT
preferred label: piège à insecticide @fr
was quoted from: Groupe de travail « Thésaurus du multirisque en forêt » du projet X-RISKS du PEPR FORESTT (ANR-24-PEFO-0005). [En ligne]. <URL : https://www.pepr-forestt.fr/projets/pc-x-risks> @fr

wind gust speed
has status: Published
type: Concept
broader: hazard characterisation
definition: Maximum instantaneous wind speed.
definition: Vitesse maximale instantanée du vent. @fr
in scheme: Thesaurus Multirisque FORESTT
preferred label: vitesse des rafales de vent @fr
was quoted from: Adapted from Météo France. [En ligne]. Toulouse, Météo France. [Consulté le 20/02/2026]. <URL : https://vigilance.meteofrance.fr/fr/dangers-meteorologiques-vent>.
was quoted from: Adapté de Météo France. [En ligne]. Toulouse, Météo France. [Consulté le 20/02/2026]. <URL : https://vigilance.meteofrance.fr/fr/dangers-meteorologiques-vent>. @fr

weeding
has status: Published
type: Concept
broader: silvicultural action
definition: Opération culturale réalisée au stade du semis qui consiste à réduire ou à supprimer la végétation herbacée indésirable, limitant la concurrence avec les jeunes arbres vis-à-vis de l'eau. @fr
definition: Cultural operation carried out at the seedling stage, consisting of reducing or removing undesirable herbaceous vegetation, limiting competition with young trees for water.
in scheme: Thesaurus Multirisque FORESTT
preferred label: désherbage @fr
was quoted from: Adapté de RNCan - Service canadien des forêts. Glossaire forestier : Sylviculture intensive. [En ligne]. 2019. [Consulté le 25/03/2026]. <URL : https://scf.rncan.gc.ca/termes/vue/1262> @fr
was quoted from: Adapted from RNCan - Service canadien des forêts. Glossaire forestier : Sylviculture intensive. [En ligne]. 2019. [Consulté le 25/03/2026]. <URL : https://scf.rncan.gc.ca/termes/vue/1262>

response to protect the owner
has status: Published
type: Concept
broader: response to protect the wood sector
definition: Action aimed either at eliminating the risk to the forest owner by removing its cause, or at reducing it by decreasing its probability of occurrence or its impact on their forest property by acting on the hazard, vulnerability or exposure of the property, or at transferring it to a third party.
definition: Action visant soit à supprimer le risque pour le propriétaire forestier en éliminant la cause, soit à le réduire en diminuant sa probabilité d’occurrence ou son impact sur sa propriété forestière en agissant sur l'aléa, la vulnérabilité ou l'exposition de sa propriété, soit à le transférer vers un tiers. @fr
in scheme: Thesaurus Multirisque FORESTT
narrower: adapt the owner's risk management and prevention practices
narrower: bringing owners closer to advisory structures
preferred label: réponse pour protéger le propriétaire @fr
was quoted from: Adapté de FAO. Agrovoc : gestion du risque. [En ligne]. FAO. [Consulté le 07/04/2026]. <URL : https://agrovoc.fao.org/browse/agrovoc/fr/page/c_37934> @fr
was quoted from: Adapted from FAO. Agrovoc : gestion du risque. [En ligne]. FAO. [Consulté le 07/04/2026]. <URL : https://agrovoc.fao.org/browse/agrovoc/fr/page/c_37934>

installation of tit nest boxes
has status: Published
type: Concept
broader: biological control
definition: Pose de nichoirs en forêt pour favoriser la nidification des mésanges afin de réguler biologiquement par la prédation les chenilles processionnaires du pin. @fr
definition: Installation of nest boxes in the forest to encourage tit nesting in order to biologically regulate pine processionary caterpillars through predation.
in scheme: Thesaurus Multirisque FORESTT
preferred label: installation de nichoir à mésange @fr
was quoted from: Adapté de Brinquin et al. (2023) Les clés pour lutter contre la processionnaire du pin. INRAE - UEFM, septembre 2023. [En ligne]. [Consulté le 25/03/2026]. <URL : https://uefm.paca.hub.inrae.fr/content/download/3813/38044?version=3> @fr
was quoted from: Adapted from Brinquin et al. (2023) Les clés pour lutter contre la processionnaire du pin. INRAE - UEFM, septembre 2023. [En ligne]. [Consulté le 25/03/2026]. <URL : https://uefm.paca.hub.inrae.fr/content/download/3813/38044?version=3>

plant identified with respect to pine wood nematode
has status: Published
type: Concept
alternative label: tree symptomatic to pine wood nematode
alternative label: arbre symptomatique vis-à-vis du nématode du pin @fr
broader: sensitive host
definition: Species listed as a potential host of the pine wood nematode.
definition: Espèce répertoriée comme hôte potentiel du nématode du pin. @fr
in scheme: Thesaurus Multirisque FORESTT
preferred label: végétal identifié vis-à-vis du nématode du pin @fr
was quoted from: Adapté de Plan national d'intervention sanitaire d'urgence relatif à Bursaphelenchus xylophilus (nématode du pin). [En ligne]. [Consulté le 20/02/2026]. <URL : https://info.agriculture.gouv.fr/boagri/instruction-2019-209>. @fr
was quoted from: Adapted from Plan national d'intervention sanitaire d'urgence relatif à Bursaphelenchus xylophilus (nématode du pin). [En ligne]. [Consulté le 20/02/2026]. <URL : https://info.agriculture.gouv.fr/boagri/instruction-2019-209>.

shallow root exploration depth
has status: Published
type: Concept
broader: individual factor
definition: Shallow rooting limiting a tree's access to water.
definition: Enracinement peu profond limitant l’accès d'un arbre à l’eau. @fr
in scheme: Thesaurus Multirisque FORESTT
preferred label: faible profondeur de prospection racinaire @fr
was quoted from: Adapted from FAO Agrovoc. [En ligne]. Rome, FAO. [Consulté le 20/02/2026]. <URL : http://aims.fao.org/aos/agrovoc/c_ce56d428>.
was quoted from: Adapté de FAO Agrovoc. [En ligne]. Rome, FAO. [Consulté le 20/02/2026]. <URL : http://aims.fao.org/aos/agrovoc/c_ce56d428>. @fr

insecticide treatment
has status: Published
type: Concept
alternative label: phytocide
broader: curative management, direct control
definition: Application d'une préparation chimique ou biologique servant à tuer ou à perturber le développement des insectes ravageurs des forêts. @fr
definition: Application of a chemical or biological preparation used to kill or disrupt the development of forest pest insects.
in scheme: Thesaurus Multirisque FORESTT
narrower: chemical insecticide treatment
narrower: non-chemical insecticide treatment
preferred label: traitement insecticide @fr
was quoted from: Adapté de RNCan - Service canadien des forêts. Glossaire forestier : Sylviculture intensive. [En ligne]. 2019. [Consulté le 25/03/2026]. <URL : https://scf.rncan.gc.ca/termes/vue/710> @fr
was quoted from: Adapted from RNCan - Service canadien des forêts. Glossaire forestier : Sylviculture intensive. [En ligne]. 2019. [Consulté le 25/03/2026]. <URL : https://scf.rncan.gc.ca/termes/vue/710>

pheromone trap
has status: Published
type: Concept
broader: use of attractants
definition: Dispositif de capture utilisant une phéromone de synthèse comme attractif pour attirer des insectes d'une espèce cible vers un système de capture ou de mise à mort. @fr
definition: Capture device using a synthetic pheromone as an attractant to lure insects of a target species towards a capture or kill system.
in scheme: Thesaurus Multirisque FORESTT
preferred label: piège à phéromones @fr
was quoted from: Adapté de Epsky, Morrill et Mankin (2008). Traps for Capturing Insects. In: Capinera (ed.). Encyclopedia of Entomology. Springer, Dordrecht. [En ligne]. [Consulté le 03/06/2026]. <URL : https://doi.org/10.1007/978-1-4020-6359-6_2523> @fr
was quoted from: Adapted from Epsky, Morrill et Mankin (2008). Traps for Capturing Insects. In: Capinera (ed.). Encyclopedia of Entomology. Springer, Dordrecht. [En ligne]. [Consulté le 03/06/2026]. <URL : https://doi.org/10.1007/978-1-4020-6359-6_2523>

combined impacts
has status: Published
type: Concept
alternative label: compound impacts
alternative label: impacts composés @fr
broader: cascade effect
definition: Cascade effect in which the initial impacts occur simultaneously in two different locations and propagate through separate transmission pathways before converging to affect the same recipient - whether a human being or a natural asset - exposed to the risk.
definition: Effet cascade dans lequel les impacts initiaux se produisent simultanément à deux endroits différents et se propagent par des voies de transmission distinctes avant de converger pour toucher le même destinataire – qu'il s'agisse d'un être humain ou d'un bien naturel – exposé au risque. @fr
in scheme: Thesaurus Multirisque FORESTT
preferred label: impacts combinés @fr
was quoted from: Adapted from Carter al. (2021) A conceptual framework for cross-border impacts of climate change. Global Environmental Change, 69, 102307. [En ligne]. [Consulté le 25/03/2026]. <URL : https://doi.org/10.1016/j.gloenvcha.2021.102307>
was quoted from: Adapté de Carter al. (2021) A conceptual framework for cross-border impacts of climate change. Global Environmental Change, 69, 102307. [En ligne]. [Consulté le 25/03/2026]. <URL : https://doi.org/10.1016/j.gloenvcha.2021.102307> @fr

physical protection
has status: Published
type: Concept
broader: curative management, direct control
definition: Physical barrier protecting trees against damage from insects, rodents or large ungulates.
definition: Barrière physique protégeant les arbres contre les dégâts d'insectes, de rongeurs ou de grands ongulés. @fr
in scheme: Thesaurus Multirisque FORESTT
narrower: use of accompanying vegetation
narrower: civil engineering measure
narrower: fencing
narrower: individual mechanical protection system
preferred label: protection physique @fr
was quoted from: Adapted from AIDA. Circulaire n° DPPR/SEI2/MM-05-0316 du 7 octobre 2005 relative à l’évaluation et à la prise en compte de la probabilité d’occurrence, de la cinétique, de l’intensité des effets et de la gravité des conséquences des accidents potentiels dans les études de dangers des installations classées soumises à autorisation. [En ligne]. [Consulté le 03/06/2026].
was quoted from: Adapté de AIDA. Circulaire n° DPPR/SEI2/MM-05-0316 du 7 octobre 2005 relative à l’évaluation et à la prise en compte de la probabilité d’occurrence, de la cinétique, de l’intensité des effets et de la gravité des conséquences des accidents potentiels dans les études de dangers des installations classées soumises à autorisation. [En ligne]. [Consulté le 03/06/2026]. @fr

tactical firebreak
has status: Published
type: Concept
broader: curative management, direct control
definition: Fuel break created during the course of a forest fire for firefighting needs.
definition: Coupure de combustible réalisée pendant le déroulement d'un incendie de forêt pour les nécessités de la lutte contre l'incendie. @fr
in scheme: Thesaurus Multirisque FORESTT
preferred label: coupe tactique @fr
was quoted from: Adapted from Légifrance. [En ligne]. Paris, Légifrance. [Consulté le 20/02/2026]. <URL : https://www.legifrance.gouv.fr/jorf/id/JORFSCTA000047805421>.
was quoted from: Adapté de Légifrance. [En ligne]. Paris, Légifrance. [Consulté le 20/02/2026]. <URL : https://www.legifrance.gouv.fr/jorf/id/JORFSCTA000047805421>. @fr

lack of risk culture
has status: Published
type: Concept
broader: societal and organisational vulnerability
definition: Vulnerability of the forest-wood sector related to a lack of risk culture among sector actors.
definition: Vulnérabilité de la filière forêt-bois liée au manque de culture du risque des acteurs de la filière. @fr
in scheme: Thesaurus Multirisque FORESTT
narrower: loss of crisis memory
narrower: loss of local knowledge
preferred label: manque de culture du risque @fr
was quoted from: Groupe de travail « Thésaurus du multirisque en forêt » du projet X-RISKS du PEPR FORESTT (ANR-24-PEFO-0005). [En ligne]. <URL : https://www.pepr-forestt.fr/projets/pc-x-risks> @fr

non-viable population size
has status: Published
type: Concept
broader: reproduction deficit
definition: Difficulté de régénération post-perturbation du fait d'une population de trop faible taille pour assurer la résilience du peuplement. @fr
definition: Post-disturbance regeneration difficulty due to a population too small to ensure stand resilience.
in scheme: Thesaurus Multirisque FORESTT
preferred label: taille de population non viable @fr
was quoted from: Groupe de travail « Thésaurus du multirisque en forêt » du projet X-RISKS du PEPR FORESTT (ANR-24-PEFO-0005). [En ligne]. <URL : https://www.pepr-forestt.fr/projets/pc-x-risks> @fr

torrential hazard
has status: Published
type: Concept
broader: gravitational hazard
definition: Crue des torrents en milieu montagnard avec transport de flottants, embâcles et débris. @fr
definition: Flooding of mountain torrents with transport of floating debris, jams and debris.
in scheme: Thesaurus Multirisque FORESTT
narrower: sediment aggradation
narrower: mudflow
narrower: flash flood
narrower: debris flow
narrower: scouring
preferred label: aléa torrentiel @fr
was quoted from: Adapté de Naaim-Bouvet et Richard (dir.) (2015). Les risques naturels en montagne. Éditions Quae. [En ligne]. [Consulté le 03/06/2026]. <URL : https://www.torrossa.com/en/resources/an/5063475> @fr
was quoted from: Adapted from Naaim-Bouvet et Richard (dir.) (2015). Les risques naturels en montagne. Éditions Quae. [En ligne]. [Consulté le 03/06/2026]. <URL : https://www.torrossa.com/en/resources/an/5063475>

tolerant host
has status: Published
type: Concept
broader: host species
definition: Plante supportant la présence du pathogène sans développer de maladie grave, mais ne l’élimine pas nécessairement. @fr
definition: Plant that withstands the presence of the pathogen without developing serious disease, but does not necessarily eliminate it.
in scheme: Thesaurus Multirisque FORESTT
preferred label: hôte tolérant @fr
was quoted from: Groupe de travail « Thésaurus du multirisque en forêt » du projet X-RISKS du PEPR FORESTT (ANR-24-PEFO-0005). [En ligne]. <URL : https://www.pepr-forestt.fr/projets/pc-x-risks> @fr

feedback cascade
has status: Published
type: Concept
broader: cascade effect
definition: Effet cascade dans lequel les répercussions qui se propagent d'un élément du système à un autre peuvent revenir vers les maillons antérieurs de la cascade, ce qui ajoute à la complexité de la transmission de ces répercussions et de leur influence sur le risque subi par le destinataire. @fr
definition: Cascade effect in which repercussions propagating from one element of the system to another can return to earlier links in the cascade, adding to the complexity of the transmission of these repercussions and their influence on the risk borne by the recipient.
in scheme: Thesaurus Multirisque FORESTT
preferred label: cascade de rétroaction @fr
was quoted from: Adapted from Carter al. (2021) A conceptual framework for cross-border impacts of climate change. Global Environmental Change, 69, 102307. [En ligne]. [Consulté le 25/03/2026]. <URL : https://doi.org/10.1016/j.gloenvcha.2021.102307>
was quoted from: Adapté de Carter al. (2021) A conceptual framework for cross-border impacts of climate change. Global Environmental Change, 69, 102307. [En ligne]. [Consulté le 25/03/2026]. <URL : https://doi.org/10.1016/j.gloenvcha.2021.102307> @fr

protective silviculture
has status: Published
type: Concept
broader: silvicultural action
definition: Gestion forestière renforçant le rôle de protection d'une forêt vis-à-vis des aléas gravitaires. @fr
definition: Forest management strengthening a forest's protective role against gravitational hazards.
in scheme: Thesaurus Multirisque FORESTT
preferred label: sylviculture de protection @fr
was quoted from: Adapté de ONF. Restauration des terrains en montagne : une mission historique de l'ONF. [En ligne]. Office national des forêts. [Consulté le 02/04/2026]. <URL : https://www.onf.fr/vivre-la-foret/enjeux-foret/risques-naturels-foret/restauration-terrains-montagne/%2B/2318::restauration-des-terrains-en-montagne-une-mission-historique-de-lonf.html> @fr
was quoted from: Adapted from ONF. Restauration des terrains en montagne : une mission historique de l'ONF. [En ligne]. Office national des forêts. [Consulté le 02/04/2026]. <URL : https://www.onf.fr/vivre-la-foret/enjeux-foret/risques-naturels-foret/restauration-terrains-montagne/%2B/2318::restauration-des-terrains-en-montagne-une-mission-historique-de-lonf.html>

response to protect the forest
has status: Published
type: Concept
alternative label: solution pour protéger la forêt @fr
alternative label: measure to protect the forest
alternative label: mesure pour protéger la forêt @fr
alternative label: solution to protect the forest
broader: risk to the forest
definition: All mitigation, adaptation and risk management measures taken by humans aimed at reducing forest damage.
definition: Ensemble des mesures d'atténuation, d'adaptation et de gestion des risques prises par l'homme visant à réduire les dommages forestiers. @fr
in scheme: Thesaurus Multirisque FORESTT
narrower: regulatory measure
narrower: forest management for risk adaptation and management
narrower: governance measure
narrower: public policy
preferred label: réponse pour protéger la forêt @fr
was quoted from: Groupe de travail « Thésaurus du multirisque en forêt » du projet X-RISKS du PEPR FORESTT (ANR-24-PEFO-0005). [En ligne]. <URL : https://www.pepr-forestt.fr/projets/pc-x-risks> @fr

ground movement risk prevention plan (PPRMT)
has status: Published
type: Concept
broader: foreseeable natural risk prevention plan
definition: Planning and prevention document dedicated to risks induced by ground movements: collapses, subsidence, rockfalls and/or block falls, landslides and associated mudflows, dune advances, coastline or cliff retreat, clay shrink/swell.
definition: Document de planification et de prévention dédié aux risques induits par les mouvements de terrain : effondrements, affaissements, éboulements de pierres et/ou de blocs, glissements de terrain et coulées de boue associées, avancées dunaires, recul du trait de côte ou de falaise, retrait/gonflement des argiles @fr
in scheme: Thesaurus Multirisque FORESTT
preferred label: plan de prévention du risque mouvement de terrain (pprmt) @fr
was quoted from: Adapted from Géorisques. Plan de prévention des risques mouvement de terrain (PPRMT). [En ligne]. Ministère de la Transition écologique, glossaire Géorisques. [Consulté le 25/03/2026]. <URL : https://www.georisques.gouv.fr/glossaire/plan-de-prevention-des-risques-mouvement-de-terrain>
was quoted from: Adapté de Géorisques. Plan de prévention des risques mouvement de terrain (PPRMT). [En ligne]. Ministère de la Transition écologique, glossaire Géorisques. [Consulté le 25/03/2026]. <URL : https://www.georisques.gouv.fr/glossaire/plan-de-prevention-des-risques-mouvement-de-terrain> @fr

pathogenic virus
has status: Published
type: Concept
alternative label: agent pathogène viral @fr
alternative label: viral pathogen
broader: non-fungal phytopathogenic agent
definition: Primitive micro-organism that must infect a plant's living cells to replicate and which causes disease.
definition: Microorganisme primitif qui doit infecter les cellules vivantes d’une plante pour se répliquer et qui provoque des maladies. @fr
in scheme: Thesaurus Multirisque FORESTT
preferred label: virus pathogène @fr

combustibility
has status: Published
type: Concept
broader: forest sensitivity
definition: Propensity of a fuel to ignite and burn, the latter property being measured by the energy released during combustion, the duration of combustion, or the proportion of biomass burnt.
definition: Propension d'un combustible à s'enflammer et à brûler qui se mesure pour cette dernière propriété par l'énergie libérée pendant la combustion, la durée de la combustion ou la proportion de biomasse brûlée. @fr
in scheme: Thesaurus Multirisque FORESTT
preferred label: combustibilité @fr
was quoted from: Adapté de Revertegat et al. (2025) Synthèse sur la vulnérabilité des peuplements forestiers au feu. Rapport final du projet AFORCE VULNEFEU (Vulnefeu04). [En ligne]. Réseau AFORCE, 2025. [Consulté le 25/03/2026]. <URL : https://www.reseau-aforce.fr/sites/reseau-aforce/files/2025-07/Rapport-Vulnefeu04-compressed.pdf @fr
was quoted from: Adapted from Revertegat et al. (2025) Synthèse sur la vulnérabilité des peuplements forestiers au feu. Rapport final du projet AFORCE VULNEFEU (Vulnefeu04). [En ligne]. Réseau AFORCE, 2025. [Consulté le 25/03/2026]. <URL : https://www.reseau-aforce.fr/sites/reseau-aforce/files/2025-07/Rapport-Vulnefeu04-compressed.pdf

lesion size
has status: Published
type: Concept
broader: damage characterisation
definition: Dimension des lésions causées par un pathogène ou un blessure mécanique. @fr
definition: Size of lesions caused by a pathogen or mechanical injury.
in scheme: Thesaurus Multirisque FORESTT
preferred label: taille de lésion @fr
was quoted from: Adapté de RNCan - Service canadien des forêts. Glossaire forestier : Sylviculture intensive. [En ligne]. 2019. [Consulté le 25/03/2026]. <URL : https://scf.rncan.gc.ca/termes/vue/31> @fr
was quoted from: Adapted from RNCan - Service canadien des forêts. Glossaire forestier : Sylviculture intensive. [En ligne]. 2019. [Consulté le 25/03/2026]. <URL : https://scf.rncan.gc.ca/termes/vue/31>

vulnerability of processing actors
has status: Published
type: Concept
broader: vulnerability of the wood sector
definition: Propensity or predisposition of forest processing actors (sawmills, wood industrialists) to suffer losses. A notion encompassing various concepts and elements, such as sensitivity or fragility and the inability to cope and adapt.
definition: Propension ou prédisposition des acteurs de la transformation forestière (scierie, industriel du bois) à subir des pertes. Notion englobant divers concepts et éléments, tels que la sensibilité ou la fragilité et l’incapacité de faire face et de s’adapter. @fr
in scheme: Thesaurus Multirisque FORESTT
narrower: rise in energy costs for processing actors
narrower: low investment capacity of processing actors
narrower: dependence on markets for processing actors
narrower: dependence on supply for processing actors
narrower: rise in insurance premiums for processing actors
preferred label: vulnérabilité des acteurs de la transformation @fr
was quoted from: Adapté de GIEC (2018) Glossaire. Rapport spécial sur les conséquences d’un réchauffement planétaire de 1,5 °C. [En ligne]. Genève, GIEC. [Consulté le 20/02/2026]. <URL : https://www.ipcc.ch/site/assets/uploads/sites/2/2019/10/SR15_Glossary_french.pdf>. @fr
was quoted from: Adapted from GIEC (2018) Glossaire. Rapport spécial sur les conséquences d’un réchauffement planétaire de 1,5 °C. [En ligne]. Genève, GIEC. [Consulté le 20/02/2026]. <URL : https://www.ipcc.ch/site/assets/uploads/sites/2/2019/10/SR15_Glossary_french.pdf>.

fire intensity
has status: Published
type: Concept
broader: hazard characterisation
definition: Le débit de chaleur dégagée par unité de temps et par unité de longueur du front de feu. @fr
definition: The rate of heat release per unit of time and per unit of length of the fire front.
in scheme: Thesaurus Multirisque FORESTT
preferred label: intensité du feu @fr

silvicultural action
has status: Published
type: Concept
broader: preventive silviculture
definition: Opération sylvicole élémentaire s'inscrivant dans un traitement appliqué à un peuplement (éclaircie, élagage, ...). @fr
definition: Elementary silvicultural operation forming part of a treatment applied to a stand (thinning, pruning, ...).
in scheme: Thesaurus Multirisque FORESTT
narrower: reforestation
narrower: protective silviculture
narrower: maintenance of wooded land status
narrower: weeding
narrower: rely on natural regeneration or seeding
narrower: thinning
narrower: understory maintenance
narrower: fuel break network
narrower: treatment or extraction of felled logs
narrower: fertilisation
narrower: fuel management
narrower: pruning
narrower: fuel break
narrower: safety fuel-clearance strip
narrower: self-protection of forest stands
narrower: prescribed burning
narrower: controlled grazing
preferred label: action sylvicole @fr
was quoted from: Adapté de RNCan - Service canadien des forêts. Glossaire forestier : Sylviculture intensive. [En ligne]. 2019. [Consulté le 25/03/2026]. <URL : https://scf.rncan.gc.ca/termes/vue/1054> @fr
was quoted from: Adapted from RNCan - Service canadien des forêts. Glossaire forestier : Sylviculture intensive. [En ligne]. 2019. [Consulté le 25/03/2026]. <URL : https://scf.rncan.gc.ca/termes/vue/1054>

collar damage
has status: Published
type: Concept
broader: damage characterisation
definition: Lésion à la base du tronc. @fr
definition: Lesion at the base of the trunk.
in scheme: Thesaurus Multirisque FORESTT
preferred label: dommage au collet @fr
was quoted from: Adapté de RNCan - Service canadien des forêts. Glossaire forestier : Sylviculture intensive. [En ligne]. 2019. [Consulté le 25/03/2026]. <URL : https://scf.rncan.gc.ca/termes/vue/206> @fr
was quoted from: Adapted from RNCan - Service canadien des forêts. Glossaire forestier : Sylviculture intensive. [En ligne]. 2019. [Consulté le 25/03/2026]. <URL : https://scf.rncan.gc.ca/termes/vue/206>

discontinuous canopy
has status: Published
type: Concept
broader: structural heterogeneity
definition: Canopy formed by treetops leaving gaps.
definition: Couvert formé par les cimes laissant des trouées. @fr
in scheme: Thesaurus Multirisque FORESTT
preferred label: couvert discontinu @fr
was quoted from: Adapté de SCF RNCan. Termes. [En ligne]. Ottawa, SCF RNCan. [Consulté le 20/02/2026]. <URL : https://scf.rncan.gc.ca/termes>. @fr
was quoted from: Adapted from SCF RNCan. Termes. [En ligne]. Ottawa, SCF RNCan. [Consulté le 20/02/2026]. <URL : https://scf.rncan.gc.ca/termes>.

actor failure
has status: Published
type: Concept
alternative label: bankruptcy
alternative label: faillite @fr
alternative label: dépots de bilan @fr
alternative label: fragilité @fr
alternative label: insolvency filings
alternative label: fragility
broader: economic hazard
definition: Affaiblissement, voire arrêt d’activité d’un acteur de la filière. @fr
definition: Weakening, or even cessation of activity, of a sector actor.
in scheme: Thesaurus Multirisque FORESTT
narrower: downstream actor failure
narrower: upstream actor failure
preferred label: défaillance d'acteurs @fr
was quoted from: Adapté de Forestopic. Seripanneaux baisse le rideau, impact sur le massif des Landes de Gascogne. [En ligne]. Forestopic. [Consulté le 07/04/2026]. <URL : https://www.forestopic.com/fr/yes-i-wood/filiere-bois/1919-seripanneaux-baisse-rideau-impact-massif-landes-gascogne?highlight=WyJmZXJtZXR1cmUiLCJmZXJtZXR1cmVzIl0=> @fr
was quoted from: Adapted from Forestopic. Seripanneaux baisse le rideau, impact sur le massif des Landes de Gascogne. [En ligne]. Forestopic. [Consulté le 07/04/2026]. <URL : https://www.forestopic.com/fr/yes-i-wood/filiere-bois/1919-seripanneaux-baisse-rideau-impact-massif-landes-gascogne?highlight=WyJmZXJtZXR1cmUiLCJmZXJtZXR1cmVzIl0=>

multi-hazard impact
has status: Published
type: Concept
broader: multi-hazard
definition: Impact cumulé ou amplifié lié à la coexistence de plusieurs aléas. @fr
definition: Cumulative or amplified impact linked to the coexistence of several hazards.
in scheme: Thesaurus Multirisque FORESTT
preferred label: impact multi-aléa @fr
was quoted from: Groupe de travail « Thésaurus du multirisque en forêt » du projet X-RISKS du PEPR FORESTT (ANR-24-PEFO-0005). [En ligne]. <URL : https://www.pepr-forestt.fr/projets/pc-x-risks> @fr

warm site
has status: Published
type: Concept
alternative label: high temperature
alternative label: forte température @fr
broader: weather characteristic
definition: Site with strong sunshine exposure and high temperatures.
definition: Station à forte insolation et températures élevées. @fr
in scheme: Thesaurus Multirisque FORESTT
preferred label: station chaude @fr
was quoted from: Groupe de travail « Thésaurus du multirisque en forêt » du projet X-RISKS du PEPR FORESTT (ANR-24-PEFO-0005). [En ligne]. <URL : https://www.pepr-forestt.fr/projets/pc-x-risks> @fr

lack of staff for support services
has status: Published
type: Concept
broader: vulnerability of support services
definition: Vulnérabilité des services d'appui à la filière forêt-bois liée à leur sous-effectif. @fr
definition: Vulnerability of forest-wood sector support services related to understaffing.
in scheme: Thesaurus Multirisque FORESTT
preferred label: manque de personnel pour les services d'appui @fr
was quoted from: Groupe de travail « Thésaurus du multirisque en forêt » du projet X-RISKS du PEPR FORESTT (ANR-24-PEFO-0005). [En ligne]. <URL : https://www.pepr-forestt.fr/projets/pc-x-risks> @fr

canker size
has status: Published
type: Concept
broader: damage characterisation
definition: Dimension de la lésion du cambium et de l’écorce. @fr
definition: Size of the cambium and bark lesion.
in scheme: Thesaurus Multirisque FORESTT
preferred label: taille de chancre @fr
was quoted from: Adapté de RNCan - Service canadien des forêts. Glossaire forestier : Sylviculture intensive. [En ligne]. 2019. [Consulté le 25/03/2026]. <URL : https://scf.rncan.gc.ca/termes/vue/31> @fr
was quoted from: Adapted from RNCan - Service canadien des forêts. Glossaire forestier : Sylviculture intensive. [En ligne]. 2019. [Consulté le 25/03/2026]. <URL : https://scf.rncan.gc.ca/termes/vue/31>

rock slide
has status: Published
type: Concept
broader: rapid ground movement
definition: Détachement brutal, depuis une paroi (sub)verticale, d’une masse rocheuse de volume supérieur à 100 dm3, et qui se propage rapidement vers l’aval sous l’effet de la gravité. @fr
definition: Sudden detachment, from a (sub)vertical rock face, of a rock mass larger than 100 dm3, which rapidly propagates downhill under the effect of gravity.
in scheme: Thesaurus Multirisque FORESTT
preferred label: éboulement @fr
was quoted from: Adapté de INRAE. Chutes de blocs et risque rocheux : quand la montagne gronde. [En ligne]. Publié le 15 avril 2024. [Consulté le 25/03/2026]. <URL : https://www.inrae.fr/dossiers/chutes-blocs-risque-rocheux-quand-montagne-gronde> @fr
was quoted from: Adapted from INRAE. Chutes de blocs et risque rocheux : quand la montagne gronde. [En ligne]. Publié le 15 avril 2024. [Consulté le 25/03/2026]. <URL : https://www.inrae.fr/dossiers/chutes-blocs-risque-rocheux-quand-montagne-gronde>

frost duration
has status: Published
type: Concept
broader: hazard characterisation
definition: Measurable period during which temperature remains below 0 °C.
definition: Période mesurable pendant laquelle la température reste inférieure à 0 °C. @fr
in scheme: Thesaurus Multirisque FORESTT
preferred label: durée du gel @fr
was quoted from: Adapted from EPHYTIA-INRAE. [En ligne]. [Consulté le 20/02/2026]. <URL : https://ephytia.inrae.fr/fr/C/18542/Forets-Froids-gelees>.
was quoted from: Adapté de EPHYTIA-INRAE. [En ligne]. [Consulté le 20/02/2026]. <URL : https://ephytia.inrae.fr/fr/C/18542/Forets-Froids-gelees>. @fr

near-surface water table depth
has status: Published
type: Concept
alternative label: hauteur de remontée capillaire @fr
alternative label: capillary rise height
broader: root system waterlogging intensity
definition: Niveau de la nappe temporaire superficielle. @fr
definition: Level of the shallow perched water table.
in scheme: Thesaurus Multirisque FORESTT
narrower: anoxia
narrower: hypoxia
preferred label: hauteur d'eau proche de la surface @fr
was quoted from: Adapté de Lévy et Lefèvre (2001). La forêt et sa culture sur sol à nappe temporaire : contraintes subies, choix des essences, interventions et gestion durable. ENGREF, Nancy, 224 p @fr
was quoted from: Adapted from Lévy et Lefèvre (2001). La forêt et sa culture sur sol à nappe temporaire : contraintes subies, choix des essences, interventions et gestion durable. ENGREF, Nancy, 224 p

hydric network
has status: Published
type: Concept
broader: general surveillance
definition: Relevés hebdomadaires de végétation pendant la saison feux de forêt afin d’en mesurer le niveau de sécheresse pour compléter l'évaluation du niveau de danger par l'état hydrique de la végétation vivante. @fr
definition: Weekly vegetation surveys during the forest fire season to measure drought levels, complementing the danger level assessment through the water status of living vegetation.
in scheme: Thesaurus Multirisque FORESTT
preferred label: réseau-hydrique @fr
was quoted from: Adapté de Observatoire des forêts françaises. Évaluer le niveau de risque. 2024. [En ligne]. Observatoire des forêts françaises. [Consulté le 02/04/2026]. <URL : https://observatoire.foret.gouv.fr/themes/evaluer-le-niveau-de-risque> @fr
was quoted from: Adapted from Observatoire des forêts françaises. Évaluer le niveau de risque. 2024. [En ligne]. Observatoire des forêts françaises. [Consulté le 02/04/2026]. <URL : https://observatoire.foret.gouv.fr/themes/evaluer-le-niveau-de-risque>

refuge zone management
has status: Published
type: Concept
broader: open habitat management
definition: Spatial separation of refuge zones for large ungulates from regenerating areas sensitive to browsing.
definition: Séparation spatiale des zones de refuges pour les grands ongulés des zones en régénération sensibles à l'abroutissement. @fr
in scheme: Thesaurus Multirisque FORESTT
preferred label: gestion des zones de refuge @fr
was quoted from: Adapté de Marell et al. (2022) Risques environnementaux et ongulés sauvages : un sujet à multiples facettes. [Rapport de recherche] INRAE UR EFNO; INRAE UR CEFS. 2022, pp.44. [En ligne]. [Consulté le 25/03/2026]. <URL: https://hal.inrae.fr/hal-03630674>. @fr
was quoted from: Adapted from Marell et al. (2022) Risques environnementaux et ongulés sauvages : un sujet à multiples facettes. [Rapport de recherche] INRAE UR EFNO; INRAE UR CEFS. 2022, pp.44. [En ligne]. [Consulté le 25/03/2026]. <URL: https://hal.inrae.fr/hal-03630674>.

resilient species
has status: Published
type: Concept
broader: sensitivity related to species composition
definition: Espèce en générale feuillue, formant une communauté végétale capable de conserver ou de reprendre son fonctionnement et son développement normal après une perturbation d'origine gravitaire. @fr
definition: Generally broadleaved species, forming a plant community capable of maintaining or resuming its normal functioning and development after a gravitational disturbance.
in scheme: Thesaurus Multirisque FORESTT
preferred label: espèce résiliente @fr
was quoted from: Adapté de SCF RNCan & CNPF. [En ligne]. [Consulté le 20/02/2026]. <URL : https://scf.rncan.gc.ca/termes/vue/963>. @fr
was quoted from: Adapted from SCF RNCan & CNPF. [En ligne]. [Consulté le 20/02/2026]. <URL : https://scf.rncan.gc.ca/termes/vue/963>.

storm-damaged timber
has status: Published
type: Concept
broader: crisis timber
definition: Bois issu d'arbre, renversé, déraciné ou rompu par le vent. @fr
definition: Wood from trees blown down, uprooted or broken by wind.
in scheme: Thesaurus Multirisque FORESTT
narrower: windthrow
narrower: windsnap top
preferred label: bois de tempête @fr
was quoted from: Adapté de RNCan - Service canadien des forêts. Glossaire forestier : Sylviculture intensive. [En ligne]. 2019. [Consulté le 25/03/2026]. <URL : https://scf.rncan.gc.ca/termes/vue/370> @fr
was quoted from: Adapted from RNCan - Service canadien des forêts. Glossaire forestier : Sylviculture intensive. [En ligne]. 2019. [Consulté le 25/03/2026]. <URL : https://scf.rncan.gc.ca/termes/vue/370>

weather characteristic
has status: Published
type: Concept
alternative label: normale climatique @fr
alternative label: bilan hydrique climatique (P, ETP) @fr
alternative label: climate normal
alternative label: climatic water balance (P, ETP)
broader: sensitivity related to site conditions
definition: Conditions météorologiques d'une station forestière influençant les risques. @fr
definition: Weather conditions at a forest station influencing risks.
in scheme: Thesaurus Multirisque FORESTT
narrower: xeric site
narrower: warm site
preferred label: caractéristique météorologique @fr
was quoted from: Adapté de CNPF. Les stations forestières. [En ligne]. Centre National de la Propriété Forestière (CNPF), Outils et techniques. [Consulté le 25/03/2026]. <URL : https://www.cnpf.fr/nos-actions-nos-outils/outils-et-techniques/les-stations-forestieres> @fr
was quoted from: Adapted from CNPF. Les stations forestières. [En ligne]. Centre National de la Propriété Forestière (CNPF), Outils et techniques. [Consulté le 25/03/2026]. <URL : https://www.cnpf.fr/nos-actions-nos-outils/outils-et-techniques/les-stations-forestieres>

disease emergence
has status: Published
type: Concept
broader: hazard characterisation
definition: Appearance and spread of a forest disease in a given area.
definition: Apparition et propagation d’une maladie forestière dans une zone donnée. @fr
in scheme: Thesaurus Multirisque FORESTT
preferred label: émergence d'une maladie @fr
was quoted from: Adapted from Robin et al. (2018) Émergences de maladies chez les arbres forestiers : Définitions, concepts et recommandations. Revue forestière française, 2018, vol. 70, n°6, pp. 569-577. [En ligne]. HAL open science. [Consulté le 13/03/2026]. <URL : https://hal.science/hal-03447472/document>
was quoted from: Adapté de Robin et al. (2018) Émergences de maladies chez les arbres forestiers : Définitions, concepts et recommandations. Revue forestière française, 2018, vol. 70, n°6, pp. 569-577. [En ligne]. HAL open science. [Consulté le 13/03/2026]. <URL : https://hal.science/hal-03447472/document> @fr

treatment or extraction of felled logs
has status: Published
type: Concept
broader: silvicultural action
definition: Extraction rapide ou traitement phytosanitaire des stocks de bois exploités pour éviter la pullulation des bioagresseurs et la dépréciation de la qualité du bois. @fr
definition: Rapid extraction or phytosanitary treatment of harvested wood stocks to avoid bioagressor outbreaks and depreciation of wood quality.
in scheme: Thesaurus Multirisque FORESTT
preferred label: traitement ou extraction grumes abattues @fr
was quoted from: Adapté de Communes forestières Franche-Comté. Le traitement des grumes... du bon usage des produits phytosanitaires. [En ligne]. Fédération Nationale des Communes Forestières. [Consulté le 01/04/2026]. <URL : https://www.communesforestieresfrance.fr/docs/library/2109480422319519500.pdf> @fr
was quoted from: Adapted from Communes forestières Franche-Comté. Le traitement des grumes... du bon usage des produits phytosanitaires. [En ligne]. Fédération Nationale des Communes Forestières. [Consulté le 01/04/2026]. <URL : https://www.communesforestieresfrance.fr/docs/library/2109480422319519500.pdf>

reference hazard
has status: Published
type: Concept
broader: tipping point
definition: Événement que l’on considère comme la base de référence pour la prévention et la réglementation des risques. Il s’agit soit de l’événement le plus important connu et documenté, soit de l’événement théorique le plus important. @fr
definition: Event considered as the reference baseline for risk prevention and regulation. It is either the most significant known and documented event, or the most significant theoretical event.
in scheme: Thesaurus Multirisque FORESTT
preferred label: aléa de référence @fr
was quoted from: Adapté de INERIS - AIDA. Livre V : Prévention des pollutions, des risques et des nuisances – Titre VI : Prévention des risques naturels. [En ligne]. Base AIDA. [Consulté le 25/03/2026]. <URL : https://aida.ineris.fr/reglementation/livre-v-prevention-pollutions-risques-nuisances-titre-vi-prevention-risques-naturels> @fr
was quoted from: Adapted from INERIS - AIDA. Livre V : Prévention des pollutions, des risques et des nuisances – Titre VI : Prévention des risques naturels. [En ligne]. Base AIDA. [Consulté le 25/03/2026]. <URL : https://aida.ineris.fr/reglementation/livre-v-prevention-pollutions-risques-nuisances-titre-vi-prevention-risques-naturels>

ONF mountain land restoration service (RTM)
has status: Published
type: Concept
broader: governance measure
definition: Mountain land restoration service, within the ONF, specialised in the prevention of natural risks in mountain areas that threaten property and people: avalanches, ground movements, rockfalls, torrential floods.
definition: Service de restauration des terrains en montagne, au sein de l'ONF, spécialisé dans la prévention des risques naturels en montagne qui menacent les biens et les personnes : avalanches, mouvements de terrains, chutes de blocs, crues torrentielles. @fr
in scheme: Thesaurus Multirisque FORESTT
preferred label: service rtm onf @fr
was quoted from: Adapted from Préfecture de Savoie. Service RTM - Restauration des Terrains en Montagne. [En ligne]. [Consulté le 25/03/2026]. <URL : https://www.savoie.gouv.fr/services-de-l-etat/agriculture-environnement-amenagement-et-logement/service-de-restauration-des-terrains-en-montagne-rtm>
was quoted from: Adapté de Préfecture de Savoie. Service RTM - Restauration des Terrains en Montagne. [En ligne]. [Consulté le 25/03/2026]. <URL : https://www.savoie.gouv.fr/services-de-l-etat/agriculture-environnement-amenagement-et-logement/service-de-restauration-des-terrains-en-montagne-rtm> @fr

time window of risk measurement
has status: Published
type: Concept
broader: spatio-temporal framework of risk measurement
definition: Définition de la période temporelle sur laquelle porte l'analyse du système d'intérêt soumis au risque. @fr
definition: Definition of the time period covered by the analysis of the system of interest subject to risk.
in scheme: Thesaurus Multirisque FORESTT
preferred label: fenêtre temporelle de la mesure du risque @fr
was quoted from: Groupe de travail « Thésaurus du multirisque en forêt » du projet X-RISKS du PEPR FORESTT (ANR-24-PEFO-0005). [En ligne]. <URL : https://www.pepr-forestt.fr/projets/pc-x-risks> @fr

emerging organism
has status: Published
type: Concept
alternative label: problème émergent @fr
alternative label: emerging problem
broader: hazard characterisation
definition: Organisme nuisible dont le risque ou l'impact dans une zone donnée a récemment augmenté de manière significative, en raison de changements liés à ses caractéristiques biologiques, à ses plantes hôtes, à ses voies de dissémination ou aux conditions environnementales. @fr
definition: Harmful organism whose risk or impact in a given area has recently increased significantly, due to changes related to its biological characteristics, its host plants, its dissemination pathways or environmental conditions.
in scheme: Thesaurus Multirisque FORESTT
preferred label: émergent @fr
was quoted from: Groupe de travail « Thésaurus du multirisque en forêt » du projet X-RISKS du PEPR FORESTT (ANR-24-PEFO-0005). [En ligne]. <URL : https://www.pepr-forestt.fr/projets/pc-x-risks> @fr

rust fungal disease
has status: Published
type: Concept
broader: fungal phytopathogenic agent
definition: Organisme fongique basidiomycète parasite hautement spécialisé des tissus vivants. @fr
definition: Highly specialised parasitic basidiomycete fungal organism affecting living tissue.
in scheme: Thesaurus Multirisque FORESTT
preferred label: maladie fongique de type rouille @fr
was quoted from: Adapté de EPHYTIA-INRAE. Rouilles - basidiomycètes. [En ligne]. [Consulté le 20/02/2026]. <URL : https://ephytia.inrae.fr/fr/C/20420/Forets-Rouilles-basidiomycetes>. @fr
was quoted from: Adapted from EPHYTIA-INRAE. Rouilles - basidiomycètes. [En ligne]. [Consulté le 20/02/2026]. <URL : https://ephytia.inrae.fr/fr/C/20420/Forets-Rouilles-basidiomycetes>.

risk to the forest
has status: Published
type: Concept
definition: Éventualité de conséquences néfastes pour la forêt, dont l’occurrence ou l’ampleur sont incertaines. Résultat de l'interaction de la vulnérabilité (de la forêt) de la durée d’exposition (à l’aléa), de l’aléa considéré et de sa probabilité d’occurrence. @fr
definition: The potential for adverse consequences for the forest, the occurrence or magnitude of which is uncertain. It results from the interaction of the vulnerability (of the forest), the duration of exposure (to the hazard), the hazard considered and its probability of occurrence.
in scheme: Thesaurus Multirisque FORESTT
narrower: response to protect the forest
narrower: characterisation of damage to the forest
narrower: vulnerability of the forest
narrower: hazard affecting the forest
narrower: non-forest asset at risk
narrower: forest asset at risk
preferred label: risque pour la forêt @fr
top concept of: Thesaurus Multirisque FORESTT
was quoted from: Adapté de GIEC (2018) Glossaire. Rapport spécial sur les conséquences d’un réchauffement planétaire de 1,5 °C. [En ligne]. Genève, GIEC. [Consulté le 20/02/2026]. <URL : https://www.ipcc.ch/site/assets/uploads/sites/2/2019/10/SR15_Glossary_french.pdf>. @fr
was quoted from: Adapted from GIEC (2018) Glossaire. Rapport spécial sur les conséquences d’un réchauffement planétaire de 1,5 °C. [En ligne]. Genève, GIEC. [Consulté le 20/02/2026]. <URL : https://www.ipcc.ch/site/assets/uploads/sites/2/2019/10/SR15_Glossary_french.pdf>.

forest fire hazard mapping
has status: Published
type: Concept
broader: governance measure
definition: Maps of the level of danger of forest fire occurrence and the level of potential fire intensity.
definition: Cartographies du niveau de danger d'occurrence des feux de forêt et du niveau d'intensité potentielle des feux. @fr
in scheme: Thesaurus Multirisque FORESTT
narrower: danger zone
preferred label: cartographie de l'aléa feu de forêt @fr
was quoted from: Adapted from INRAE. Décryptage - Risque incendie. [En ligne]. Publié le 28 juin 2022. [Consulté le 25/03/2026]. <URL : https://www.inrae.fr/dossiers/decryptage-risque-incendie>
was quoted from: Adapté de INRAE. Décryptage - Risque incendie. [En ligne]. Publié le 28 juin 2022. [Consulté le 25/03/2026]. <URL : https://www.inrae.fr/dossiers/decryptage-risque-incendie> @fr

human asset at risk
has status: Published
type: Concept
broader: non-forest asset at risk
definition: Human presence in an area exposed to forest hazards.
definition: Présence humaine dans une zone exposée aux aléas de la forêt. @fr
in scheme: Thesaurus Multirisque FORESTT
narrower: human life
narrower: human health
preferred label: enjeu humain @fr
was quoted from: Adapté de GIEC (2018) Glossaire. [En ligne]. Genève, GIEC. [Consulté le 20/02/2026]. <URL : https://www.ipcc.ch/site/assets/uploads/sites/2/2019/10/SR15_Glossary_french.pdf>. @fr
was quoted from: Adapted from GIEC (2018) Glossaire. [En ligne]. Genève, GIEC. [Consulté le 20/02/2026]. <URL : https://www.ipcc.ch/site/assets/uploads/sites/2/2019/10/SR15_Glossary_french.pdf>.

understory maintenance
has status: Published
type: Concept
broader: silvicultural action
definition: Management of the understory to reduce fuel load and manage health risks.
definition: Gestion du sous-étage pour réduire le combustible, et gérer les risques sanitaires. @fr
in scheme: Thesaurus Multirisque FORESTT
preferred label: entretien du sous-bois @fr
was quoted from: Groupe de travail « Thésaurus du multirisque en forêt » du projet X-RISKS du PEPR FORESTT (ANR-24-PEFO-0005). [En ligne]. <URL : https://www.pepr-forestt.fr/projets/pc-x-risks> @fr

fire occurrence
has status: Published
type: Concept
alternative label: fire frequency
alternative label: fréquence du feu @fr
broader: hazard characterisation
definition: Terme général désignant la fréquence des incendies dans une zone donnée au fil du temps. @fr
definition: General term designating the frequency of fires in a given area over time.
in scheme: Thesaurus Multirisque FORESTT
preferred label: occurrence du feu @fr

exposed actor of secondary processing
has status: Published
type: Concept
broader: exposed actor of the forest-wood sector
definition: Acteur de la seconde transformation (meubles, éléments de construction ou emballages ...) susceptible de subir des dommages, du fait de son exposition à des aléas. @fr
definition: Actor of secondary processing (furniture, construction elements or packaging...) likely to suffer damage due to exposure to hazards.
in scheme: Thesaurus Multirisque FORESTT
preferred label: acteur exposé de la seconde transformation @fr
was quoted from: Groupe de travail « Thésaurus du multirisque en forêt » du projet X-RISKS du PEPR FORESTT (ANR-24-PEFO-0005). [En ligne]. <URL : https://www.pepr-forestt.fr/projets/pc-x-risks> @fr

reconstitution assistance
has status: Published
type: Concept
broader: reconstitution plan
definition: Modalités de financement des travaux de reconstitution des peulements forestiers sinistrés. @fr
definition: Funding arrangements for reconstitution work on damaged forest stands.
in scheme: Thesaurus Multirisque FORESTT
preferred label: aide à la reconstitution @fr
was quoted from: Adapté de Ministère de la Transition écologique. Dispositif d’aide au renouvellement forestier. [En ligne]. Ministère de la Transition écologique. [Consulté le 07/04/2026]. <URL : https://www.ecologie.gouv.fr/politiques-publiques/dispositif-daide-renouvellement-forestier> @fr
was quoted from: Adapted from Ministère de la Transition écologique. Dispositif d’aide au renouvellement forestier. [En ligne]. Ministère de la Transition écologique. [Consulté le 07/04/2026]. <URL : https://www.ecologie.gouv.fr/politiques-publiques/dispositif-daide-renouvellement-forestier>

chemical insecticide treatment
has status: Published
type: Concept
broader: insecticide treatment
definition: Application d'une préparation chimique servant à tuer ou à perturber le développement des insectes ravageurs des forêts. @fr
definition: Application of a chemical preparation used to kill or disrupt the development of forest pest insects.
in scheme: Thesaurus Multirisque FORESTT
preferred label: traitement insecticide chimique @fr
was quoted from: Adapté de RNCan - Service canadien des forêts. Glossaire forestier : Sylviculture intensive. [En ligne]. 2019. [Consulté le 25/03/2026]. <URL : https://scf.rncan.gc.ca/termes/vue/710> @fr
was quoted from: Adapted from RNCan - Service canadien des forêts. Glossaire forestier : Sylviculture intensive. [En ligne]. 2019. [Consulté le 25/03/2026]. <URL : https://scf.rncan.gc.ca/termes/vue/710>

severe cold
has status: Published
type: Concept
broader: frost
definition: Temperature persistently dropping below -20 °C (for a week or more) and capable of destroying all or part of the tree by causing the water it contains to turn to ice.
definition: Température descendant au-dessous de - 20 ° C de façon durable (une semaine et plus) et pouvant entraîner la destruction de tout ou partie de l’arbre en provoquant la transformation de l’eau qu’il contient en glace @fr
in scheme: Thesaurus Multirisque FORESTT
preferred label: grand froid @fr
was quoted from: Adapted from Météo-France. Qu’est-ce qu’un grand froid ? [En ligne]. [Consulté le 08/06/2026]. <URL : https://vigilance.meteofrance.fr/fr/dangers-meteorologiques-grand-froid>
was quoted from: Adapté de Météo-France. Qu’est-ce qu’un grand froid ? [En ligne]. [Consulté le 08/06/2026]. <URL : https://vigilance.meteofrance.fr/fr/dangers-meteorologiques-grand-froid> @fr

genetic selection for resistance
has status: Published
type: Concept
broader: prevention through genetics
definition: Amélioration génétique des essences forestières pour augmenter leur résistance aux risques biotiques et abiotiques. @fr
definition: Genetic improvement of forest species to increase their resistance to biotic and abiotic risks.
in scheme: Thesaurus Multirisque FORESTT
preferred label: sélection génétique pour la résistance @fr
was quoted from: Adapté de RNCan - Service canadien des forêts. Glossaire forestier : Sylviculture intensive. [En ligne]. 2019. [Consulté le 25/03/2026]. <URL : https://scf.rncan.gc.ca/termes/vue/600> @fr
was quoted from: Adapted from RNCan - Service canadien des forêts. Glossaire forestier : Sylviculture intensive. [En ligne]. 2019. [Consulté le 25/03/2026]. <URL : https://scf.rncan.gc.ca/termes/vue/600>

red stage
has status: Published
type: Concept
broader: damage characterisation
definition: Defoliation stage after bark beetle attack, where needles still on the tree have turned reddish-brown.
definition: Stade de défoliation après attaque de scolyte où les aiguilles encore sur l'arbre sont roussies. @fr
in scheme: Thesaurus Multirisque FORESTT
preferred label: stade rouge @fr
was quoted from: Boutte (2024) Risques multiples et santé des forêts. DSF. [En ligne]. Paris, Ministère de l’Agriculture et de la Souveraineté alimentaire. [Consulté le 20/02/2026]. <URL : https://agriculture.gouv.fr/telecharger/144517>.

heavy thinning
has status: Published
type: Concept
broader: thinning
definition: Éclaircie enlevant un volume important de bois pour prévenir les risques liés à la sécheresse et aux feux de forêt. @fr
definition: Thinning removing a large volume of wood to prevent risks related to drought and forest fires.
in scheme: Thesaurus Multirisque FORESTT
preferred label: éclaircie de forte intensité @fr
was quoted from: Adapté de Moreau et al. (2022) Opportunities and limitations of thinning to increase resistance and resilience of trees and forests to global change. Forestry: An International Journal of Forest Research, 2022, vol. 95, n°5, pp. 595-615. [En ligne]. Oxford Academic. [Consulté le 01/04/2026]. <URL : https://doi.org/10.1093/forestry/cpac010> @fr
was quoted from: Adapted from Moreau et al. (2022) Opportunities and limitations of thinning to increase resistance and resilience of trees and forests to global change. Forestry: An International Journal of Forest Research, 2022, vol. 95, n°5, pp. 595-615. [En ligne]. Oxford Academic. [Consulté le 01/04/2026]. <URL : https://doi.org/10.1093/forestry/cpac010>

induced hazard
has status: Published
type: Concept
broader: hazard characterisation
definition: Characteristic of a fire, originating from the considered location, that generates a threat to assets located in its direction of spread.
definition: Caractéristique d'un incendie, émanant du lieu considéré et qui génère une menace pour les enjeux situés dans sa direction de propagation. @fr
in scheme: Thesaurus Multirisque FORESTT
preferred label: aléa induit @fr

vascular pathogen
type: Concept
broader: plant pathogen
definition: Microorganisme fongique ou bactérien qui infecte les tissus vasculaires (xylème) de l'arbre hôte produisant rapidement des symptômes de flétrissement et de dessèchement de rameaux et de branches. @fr
definition: Fungal or bacterial microorganism that infects the vascular tissues (xylem) of the host tree, rapidly producing wilting symptoms and dieback of twigs and branches.
in scheme: Thesaurus Multirisque FORESTT
preferred label: agent pathogène vasculaire @fr
was quoted from: Groupe de travail « Thésaurus du multirisque en forêt » du projet X-RISKS du PEPR FORESTT (ANR-24-PEFO-0005). [En ligne]. <URL : https://www.pepr-forestt.fr/projets/pc-x-risks> @fr

violent wind
has status: Published
type: Concept
broader: natural hazard
definition: Wind whose speed reaches 100 km/h in gusts inland in France.
definition: Vent dont la vitesse atteint 100 km/h en rafales dans l’intérieur des terres. @fr
in scheme: Thesaurus Multirisque FORESTT
narrower: derecho
narrower: tornado
narrower: storm
preferred label: vent violent @fr
was quoted from: Adapted from Météo France. Dangers météorologiques - vent. [En ligne]. Toulouse, Météo France. [Consulté le 20/02/2026]. <URL : https://vigilance.meteofrance.fr/fr/dangers-meteorologiques-vent>.
was quoted from: Adapté de Météo France. Dangers météorologiques - vent. [En ligne]. Toulouse, Météo France. [Consulté le 20/02/2026]. <URL : https://vigilance.meteofrance.fr/fr/dangers-meteorologiques-vent>. @fr

reconstitution plan
has status: Published
type: Concept
broader: response to protect the wood sector
definition: Modalités de financement des travaux de reconstitution des peuplements forestiers sinistrés et de mesures techniques pour l'adaptation des essences aux nouveaux risques climatiques. @fr
definition: Funding arrangements for reconstitution work on damaged forest stands and for technical measures to adapt species to new climate risks.
in scheme: Thesaurus Multirisque FORESTT
narrower: reconstitution assistance
narrower: cleanup assistance
narrower: storage assistance
narrower: transport assistance
preferred label: plan de reconstitution @fr
was quoted from: Groupe de travail « Thésaurus du multirisque en forêt » du projet X-RISKS du PEPR FORESTT (ANR-24-PEFO-0005). [En ligne]. <URL : https://www.pepr-forestt.fr/projets/pc-x-risks> @fr

requisition of personnel and equipment
has status: Published
type: Concept
broader: crisis management plan
definition: Acte d’autorité qui impose à une personne physique ou morale, ou à un bien, de se rendre disponible pour l’administrationen cas de crise majeur en forêt. @fr
definition: Act of authority requiring an individual, organisation or asset to be made available to the administration in the event of a major forest crisis.
in scheme: Thesaurus Multirisque FORESTT
preferred label: requisition du personnel et du matériel @fr
was quoted from: Adapté de Légifrance. Code de la défense - Chapitre II : Principes généraux du droit de réquisition (Articles R2212-1 à R2212-10). [En ligne]. Légifrance. [Consulté le 07/04/2026]. <URL : https://www.legifrance.gouv.fr/codes/section_lc/LEGITEXT000006071307/LEGISCTA000020410824/> @fr
was quoted from: Adapted from Légifrance. Code de la défense - Chapitre II : Principes généraux du droit de réquisition (Articles R2212-1 à R2212-10). [En ligne]. Légifrance. [Consulté le 07/04/2026]. <URL : https://www.legifrance.gouv.fr/codes/section_lc/LEGITEXT000006071307/LEGISCTA000020410824/>

abandonment of forest use
has status: Published
type: Concept
broader: sustainable management document
definition: Voluntary action directly or indirectly leading to the destruction of the wooded state of a plot of land and ending its forest purpose.
definition: Opération volontaire entraînant directement ou indirectement la destruction de l’état boisé d’un terrain et mettant fin à sa destination forestière @fr
in scheme: Thesaurus Multirisque FORESTT
preferred label: abandon de la finalité forestière @fr
was quoted from: Adapted from PRÉFET DES LANDES. Défrichement. 2026. [En ligne]. Les services de l'État dans les Landes. [Consulté le 07/04/2026]. <URL : https://www.landes.gouv.fr/Actions-de-l-Etat/Agriculture-et-Foret/Foret/Defrichement-et-gestion-forestiere/Defrichement>
was quoted from: Adapté de PRÉFET DES LANDES. Défrichement. 2026. [En ligne]. Les services de l'État dans les Landes. [Consulté le 07/04/2026]. <URL : https://www.landes.gouv.fr/Actions-de-l-Etat/Agriculture-et-Foret/Foret/Defrichement-et-gestion-forestiere/Defrichement> @fr

disease severity
has status: Published
type: Concept
broader: hazard characterisation
definition: Magnitude of the damage caused to the host by a disease.
definition: Magnitude des dommages causés à l’hôte par une maladie. @fr
in scheme: Thesaurus Multirisque FORESTT
narrower: aggressiveness
narrower: virulence
narrower: pathogenicity
preferred label: sévérité de la maladie @fr
was quoted from: Groupe de travail « Thésaurus du multirisque en forêt » du projet X-RISKS du PEPR FORESTT (ANR-24-PEFO-0005). [En ligne]. <URL : https://www.pepr-forestt.fr/projets/pc-x-risks> @fr

characterise browsing pressure
has status: Published
type: Concept
broader: regulatory measure
definition: Évaluation quantitative des dégâts causés aux jeunes arbres par les ongulés sauvages. @fr
definition: Quantitative assessment of the damage caused to young trees by wild ungulates.
in scheme: Thesaurus Multirisque FORESTT
preferred label: caractériser la pression d'abroutissement @fr
was quoted from: Adapté de Plateforme Nationale Forêt-Gibier. Abroutissement. Fiches techniques Forêt & Gibier n° 646, septembre 2021, pp. 36-37. [En ligne]. GIP ATGeRi. [Consulté le 25/03/2026]. <URL : https://plateforme-nationale-foret-gibier.cartogip.fr/documents/FdF646-sept2021_p36-37_Abroutissement.pdf> @fr
was quoted from: Adapted from Plateforme Nationale Forêt-Gibier. Abroutissement. Fiches techniques Forêt & Gibier n° 646, septembre 2021, pp. 36-37. [En ligne]. GIP ATGeRi. [Consulté le 25/03/2026]. <URL : https://plateforme-nationale-foret-gibier.cartogip.fr/documents/FdF646-sept2021_p36-37_Abroutissement.pdf>

aggregated risk
has status: Published
type: Concept
broader: multi-risk
definition: Risk to the overall performance of the economy or a specific sector, linked to the effects on macroeconomic indicators of variations in their constituent individual economic parameters.
definition: Risque sur la performance globale de l'économie ou d'un secteur spécifique, lié aux effets sur des indicateurs macroéconomiques de variations de leurs paramètres économiques individuelles constitutifs. @fr
in scheme: Thesaurus Multirisque FORESTT
preferred label: risque agrégé @fr
was quoted from: Adapted from Bansal et al. (2012) Temperature, aggregate risk, and expected returns. Working Paper n°17575, 2012. [En ligne]. National Bureau of Economic Research. [Consulté le 07/04/2026]. <URL : https://www.nber.org/system/files/working_papers/w17575/w17575.pdf>
was quoted from: Adapté de Bansal et al. (2012) Temperature, aggregate risk, and expected returns. Working Paper n°17575, 2012. [En ligne]. National Bureau of Economic Research. [Consulté le 07/04/2026]. <URL : https://www.nber.org/system/files/working_papers/w17575/w17575.pdf> @fr

restriction of recreational hunting
has status: Published
type: Concept
alternative label: perte de location de chasse @fr
alternative label: loss of hunting lease
broader: loss of cultural ecosystem service
definition: Restriction of hunting activity related to the decline in game following forest disturbances.
definition: Restriction de l’activité de chasse liée à la diminution du gibier suite aux perturbations en forêt. @fr
in scheme: Thesaurus Multirisque FORESTT
preferred label: limitation de la chasse de loisir @fr
was quoted from: Groupe de travail « Thésaurus du multirisque en forêt » du projet X-RISKS du PEPR FORESTT (ANR-24-PEFO-0005). [En ligne]. <URL : https://www.pepr-forestt.fr/projets/pc-x-risks> @fr

wood boring
has status: Published
type: Concept
broader: damage characterisation
definition: Galeries creusées par des insectes xylophages. @fr
definition: Galleries dug by wood-boring insects.
in scheme: Thesaurus Multirisque FORESTT
preferred label: perforation du bois @fr
was quoted from: EPHYTIA-INRAE. [En ligne]. [Consulté le 20/02/2026]. <URL : https://ephytia.inrae.fr/fr/c/C/24918/Forets-Insectes-cambiophages> @fr

natural hazard
has status: Published
type: Concept
broader: abiotic hazard
definition: Aléa dont l'origine est naturelle, le plus souvent climatique et / ou hydrogravitaire @fr
definition: Hazard of natural origin, most often climatic and/or hydrogravitational.
in scheme: Thesaurus Multirisque FORESTT
narrower: gravitational hazard
narrower: violent wind
narrower: snow
narrower: drought
narrower: heatwave
narrower: lightning
narrower: frost
narrower: soil erosion
narrower: root system waterlogging
narrower: flood
narrower: hail
narrower: soil salinisation
narrower: forest, agricultural land and vegetation fire
preferred label: aléa naturel @fr
was quoted from: Adapté de GIEC (2018) Glossaire. Rapport spécial sur les conséquences d'un réchauffement planétaire de 1,5 °C. [En ligne]. Genève, GIEC. [Consulté le 20/02/2026]. <URL : https://www.ipcc.ch/site/assets/uploads/sites/2/2019/10/SR15_Glossary_french.pdf>. @fr
was quoted from: Adapted from GIEC (2018) Glossaire. Rapport spécial sur les conséquences d'un réchauffement planétaire de 1,5 °C. [En ligne]. Genève, GIEC. [Consulté le 20/02/2026]. <URL : https://www.ipcc.ch/site/assets/uploads/sites/2/2019/10/SR15_Glossary_french.pdf>.

vulnerability of intensive silvicultural management models
has status: Published
type: Concept
broader: vulnerability of silvicultural management models
definition: Vulnerability of the forest-wood sector related to the intensive silvicultural management model.
definition: Vulnérabilité de la filière forêt-bois liée au modèle de gestion sylvicole intensif. @fr
in scheme: Thesaurus Multirisque FORESTT
preferred label: vulnérabilité des modèles de gestion sylvicole intensive @fr
was quoted from: Groupe de travail « Thésaurus du multirisque en forêt » du projet X-RISKS du PEPR FORESTT (ANR-24-PEFO-0005). [En ligne]. <URL : https://www.pepr-forestt.fr/projets/pc-x-risks> @fr

loss of carbon stock
has status: Published
type: Concept
alternative label: carbon sink
alternative label: séquestration carbone @fr
alternative label: puits de carbone @fr
alternative label: carbon sequestration
broader: loss of regulating ecosystem service
definition: Diminution du carbone stocké dans la biomasse et les sols des forêts. @fr
definition: Decrease in carbon stored in forest biomass and soils.
in scheme: Thesaurus Multirisque FORESTT
preferred label: perte de stock de carbone @fr
was quoted from: Adapté de Roux et al. (2017) Quel rôle pour les forêts et la filière forêt-bois françaises dans l’atténuation du changement climatique ? Une étude des freins et leviers forestiers à l’horizon 2050. Résumé. INRA ; IGN, 2017, 4 p. [En ligne]. HAL open science, hal-03150439. [Consulté le 25/03/2026]. <URL : https://hal.inrae.fr/hal-03150439> @fr
was quoted from: Adapted from Roux et al. (2017) Quel rôle pour les forêts et la filière forêt-bois françaises dans l’atténuation du changement climatique ? Une étude des freins et leviers forestiers à l’horizon 2050. Résumé. INRA ; IGN, 2017, 4 p. [En ligne]. HAL open science, hal-03150439. [Consulté le 25/03/2026]. <URL : https://hal.inrae.fr/hal-03150439>

pressure on the wood resource
has status: Published
type: Concept
broader: economic hazard
definition: Demande en produits bois supérieure à l’offre disponible. @fr
definition: Demand for wood products exceeding available supply.
in scheme: Thesaurus Multirisque FORESTT
narrower: wood shortage
preferred label: tension sur la ressource bois @fr
was quoted from: Adapté de IGN, FCBA. La forêt en 2050 : projection des disponibilités en bois et des stocks et flux de carbone du secteur forestier français. 2024. [En ligne]. IGN. [Consulté le 07/04/2026]. <URL : https://www.ign.fr/institut/espace-presse/la-foret-en-2050-projection-des-disponibilites-bois-et-stocks-et-flux-de-carbone> @fr
was quoted from: Adapted from IGN, FCBA. La forêt en 2050 : projection des disponibilités en bois et des stocks et flux de carbone du secteur forestier français. 2024. [En ligne]. IGN. [Consulté le 07/04/2026]. <URL : https://www.ign.fr/institut/espace-presse/la-foret-en-2050-projection-des-disponibilites-bois-et-stocks-et-flux-de-carbone>

sensitivity related to soil water status
has status: Published
type: Concept
broader: sensitivity related to water conditions
definition: Mesure dans laquelle un écosystème forestier est affecté par un aléa du fait de la quantité et de la disponibilité de l'eau dans le sol. @fr
definition: Extent to which a forest ecosystem is affected by a hazard due to the quantity and availability of water in the soil.
in scheme: Thesaurus Multirisque FORESTT
narrower: waterlogging of the root system in winter soils
preferred label: sensibilité liée à l'état hydrique du sol @fr
was quoted from: Adapté de Plantes-et-eau.fr. [En ligne]. [Consulté le 20/02/2026]. <URL : https://www.plantes-et-eau.fr/documentation/outils-et-concepts-de-base/17-le-sol-reservoir-d-eau-pour-les-plantes/119-les-relations-potentiel-hydrique-humidite-dans-un-sol>. @fr
was quoted from: Adapted from Plantes-et-eau.fr. [En ligne]. [Consulté le 20/02/2026]. <URL : https://www.plantes-et-eau.fr/documentation/outils-et-concepts-de-base/17-le-sol-reservoir-d-eau-pour-les-plantes/119-les-relations-potentiel-hydrique-humidite-dans-un-sol>.

cleanup assistance
has status: Published
type: Concept
broader: reconstitution plan
definition: Aide financière au nettoyage des parcelles sinistrées. @fr
definition: Financial assistance for cleaning up affected plots.
in scheme: Thesaurus Multirisque FORESTT
preferred label: aide au nettoyage @fr
was quoted from: Groupe de travail « Thésaurus du multirisque en forêt » du projet X-RISKS du PEPR FORESTT (ANR-24-PEFO-0005). [En ligne]. <URL : https://www.pepr-forestt.fr/projets/pc-x-risks> @fr

aerial intervention
has status: Published
type: Concept
broader: curative management, direct control
definition: Deployment of aircraft or helicopters during a forest fire, to drop water or retardant, transport and deploy teams and equipment, or carry out aerial reconnaissance.
definition: Déploiement d'avions ou d'hélicoptères lors d'un incendie de forêt, afin de larguer de l'eau ou du retardant, d'assurer le transport et le déploiement des équipes et du matériel, ou d'effectuer une reconnaissance aérienne. @fr
in scheme: Thesaurus Multirisque FORESTT
preferred label: intervention avec des moyens aériens @fr

slow ground movement
has status: Published
type: Concept
broader: ground movement
definition: Mouvement de terrain avec déformation progressive qui peut être accompagnée de rupture mais en principe d'aucune accélération brutale (affaissements, tassements, fluage, glissement, retrait/gonflement de certains matériaux argileux). @fr
definition: Ground movement with progressive deformation, which may be accompanied by rupture but in principle involves no sudden acceleration (subsidence, settlement, creep, sliding, shrink/swell of certain clay materials).
in scheme: Thesaurus Multirisque FORESTT
narrower: landslide
preferred label: mouvement de terrain lent @fr
was quoted from: Géorisques.gouv.fr. Mouvement de terrain. [En ligne]. Paris, Ministère de la Transition écologique. [Consulté le 20/02/2026]. <URL : https://www.georisques.gouv.fr/glossaire/mouvements-de-terrain>. @fr

homogeneous diameter structure
has status: Published
type: Concept
broader: structural heterogeneity
definition: Distribution des diamètres peu variée. @fr
definition: Distribution of diameters with little variation.
in scheme: Thesaurus Multirisque FORESTT
preferred label: structure en diamètres homogène @fr
was quoted from: Adapté de Angers et al. Complexité structurale des peuplements feuillus : Caractérisation, influences de l’aménagement et avenues pour la restauration. 2014. [En ligne]. Gouvernement du Québec, Ministère des Forêts, de la Faune et des Parcs. [Consulté le 07/04/2026]. <URL : https://diffusion.mern.gouv.qc.ca/public/biblio/mono/2015/01/1162392.pdf> @fr
was quoted from: Adapted from Angers et al. Complexité structurale des peuplements feuillus : Caractérisation, influences de l’aménagement et avenues pour la restauration. 2014. [En ligne]. Gouvernement du Québec, Ministère des Forêts, de la Faune et des Parcs. [Consulté le 07/04/2026]. <URL : https://diffusion.mern.gouv.qc.ca/public/biblio/mono/2015/01/1162392.pdf>

flood zone mapping
has status: Published
type: Concept
broader: governance measure
definition: Mapping of areas subject to flood risk.
definition: Cartographie des zones soumises au risque d’inondation. @fr
in scheme: Thesaurus Multirisque FORESTT
preferred label: cartographie zone inondable @fr
was quoted from: Adapted from Géorisques. Dossier expert sur les inondations. [En ligne]. Ministère de la Transition écologique. [Consulté le 03/06/2026]. <URL : https://www.georisques.gouv.fr/consulter-les-dossiers-thematiques/dossier-expert-sur-les-inondations>
was quoted from: Adapté de Géorisques. Dossier expert sur les inondations. [En ligne]. Ministère de la Transition écologique. [Consulté le 03/06/2026]. <URL : https://www.georisques.gouv.fr/consulter-les-dossiers-thematiques/dossier-expert-sur-les-inondations> @fr

heatwave intensity
has status: Published
type: Concept
broader: hazard characterisation
definition: Temperature deviation from local biometeorological thresholds.
definition: Écart des températures par rapport aux seuils biométéorologiques locaux. @fr
in scheme: Thesaurus Multirisque FORESTT
preferred label: intensité de la vague de chaleur @fr
was quoted from: Adapted from Météo-France. Qu’est-ce que la Vigilance canicule ? [En ligne]. Météo-France, mise à jour le 07/07/2025. [Consulté le 25/03/2026]. <URL : https://meteofrance.com/comprendre-la-vigilance/vigilance-canicule>
was quoted from: Adapté de Météo-France. Qu’est-ce que la Vigilance canicule ? [En ligne]. Météo-France, mise à jour le 07/07/2025. [Consulté le 25/03/2026]. <URL : https://meteofrance.com/comprendre-la-vigilance/vigilance-canicule> @fr

wood transport ban
has status: Published
type: Concept
broader: containment
definition: Regulation prohibiting the transport of wood contaminated by a pathogen.
definition: Réglementation interdisant le transport de bois contaminé par un agent pathogène. @fr
in scheme: Thesaurus Multirisque FORESTT
preferred label: interdiction du transport de bois @fr
was quoted from: Adapté de Plan national d'intervention sanitaire d'urgence relatif à Bursaphelenchus xylophilus (nématode du pin). [En ligne]. [Consulté le 20/02/2026]. <URL : https://info.agriculture.gouv.fr/boagri/instruction-2019-209>. @fr
was quoted from: Adapted from Plan national d'intervention sanitaire d'urgence relatif à Bursaphelenchus xylophilus (nématode du pin). [En ligne]. [Consulté le 20/02/2026]. <URL : https://info.agriculture.gouv.fr/boagri/instruction-2019-209>.

quarantine organism
has status: Published
type: Concept
broader: regulatory measure
definition: Harmful organism liable to enter, become established or spread in a given territory or zone and to have an unacceptable economic, environmental or social impact there, and for which very strict measures must be taken to prevent its entry or spread into that territory.
definition: Organisme nuisible susceptibles d'entrer, de s'établir ou de se disséminer sur ce territoire ou dans cette zone et d'y avoir une incidence économique, environnementale ou sociale inacceptable, et pour lequel des mesures très strictes doivent être prises pour empêcher leur entrée ou leur dissémination sur lesdits territoires. @fr
in scheme: Thesaurus Multirisque FORESTT
narrower: priority quarantine organism
preferred label: organisme de quarantaine @fr
was quoted from: Groupe de travail « Thésaurus du multirisque en forêt » du projet X-RISKS du PEPR FORESTT (ANR-24-PEFO-0005). [En ligne]. <URL : https://www.pepr-forestt.fr/projets/pc-x-risks> @fr

low stump-sprouting capacity
has status: Published
type: Concept
broader: natural regeneration deficit
definition: Post-fire or post-harvest regeneration difficulty in broadleaved stands due to low stump-sprouting capacity.
definition: Difficulté de régénération post-incendie ou post-coupe des peuplements feuillus du fait d'une faible capacité de rejet de souche @fr
in scheme: Thesaurus Multirisque FORESTT
preferred label: faible capacité de rejet de souche @fr
was quoted from: Adapté de Revertegat et al. (2025) Synthèse sur la vulnérabilité des peuplements forestiers au feu. Rapport final du projet AFORCE VULNEFEU (Vulnefeu04). [En ligne]. Réseau AFORCE, 2025. [Consulté le 25/03/2026]. <URL : https://www.reseau-aforce.fr/sites/reseau-aforce/files/2025-07/Rapport-Vulnefeu04-compressed.pdf @fr
was quoted from: Adapted from Revertegat et al. (2025) Synthèse sur la vulnérabilité des peuplements forestiers au feu. Rapport final du projet AFORCE VULNEFEU (Vulnefeu04). [En ligne]. Réseau AFORCE, 2025. [Consulté le 25/03/2026]. <URL : https://www.reseau-aforce.fr/sites/reseau-aforce/files/2025-07/Rapport-Vulnefeu04-compressed.pdf

root xylem-feeding insect
has status: Published
type: Concept
broader: root pest insect
definition: Insecte se nourrissant des tissus internes des racines. @fr
definition: Insect feeding on internal root tissue.
in scheme: Thesaurus Multirisque FORESTT
preferred label: insecte xylémophage des racines @fr
was quoted from: Adapté de Bouget et al. (2005) Nomenclature des groupes écologiques d’insectes liés au bois. [En ligne]. Paris, Comptes Rendus Biologies. [Consulté le 20/02/2026]. <URL : https://doi.org/10.1016/j.crvi.2005.08.003>. @fr
was quoted from: Adapted from Bouget et al. (2005) Nomenclature des groupes écologiques d’insectes liés au bois. [En ligne]. Paris, Comptes Rendus Biologies. [Consulté le 20/02/2026]. <URL : https://doi.org/10.1016/j.crvi.2005.08.003>.

change in legislation
has status: Published
type: Concept
broader: political hazard
definition: Modification des lois forestières ou environnementales qui impactent la filière forêt-bois. @fr
definition: Amendment of forest or environmental laws that impacts the forest-wood sector.
in scheme: Thesaurus Multirisque FORESTT
narrower: change in environmental regulation
narrower: land use planning
preferred label: évolution de la législation @fr
was quoted from: Adapté de Assemblée Nationale. Question écrite n°16662. [En ligne]. Assemblée Nationale. [Consulté le 07/04/2026]. <URL : https://questions.assemblee-nationale.fr/q16/16-16662QE.htm> @fr
was quoted from: Adapted from Assemblée Nationale. Question écrite n°16662. [En ligne]. Assemblée Nationale. [Consulté le 07/04/2026]. <URL : https://questions.assemblee-nationale.fr/q16/16-16662QE.htm>

vulnerability of forestry work companies
has status: Published
type: Concept
broader: vulnerability of the wood sector
definition: Propension ou prédisposition des entreprises de travaux forestiers (ETF) à subir des pertes. Notion englobant divers concepts et éléments, tels que la sensibilité ou la fragilité et l’incapacité de faire face et de s’adapter. @fr
definition: Propensity or predisposition of forestry work companies (FWCs) to suffer losses. A notion encompassing various concepts and elements, such as sensitivity or fragility and the inability to cope and adapt.
in scheme: Thesaurus Multirisque FORESTT
narrower: difficulty for forestry work companies in negotiating fair prices
narrower: irregular workload for forestry work companies
narrower: recruitment difficulty for forestry work companies
narrower: rise in insurance premiums for forestry work companies
narrower: cash flow difficulty for forestry work companies
narrower: accumulation of weather hazards
narrower: environmental regulation applying to forestry work companies
narrower: workplace accident
narrower: excessive specialisation of forestry work companies
narrower: redundancy
preferred label: vulnérabilité des entreprises de travaux forestiers @fr
was quoted from: Adapté de GIEC (2018) Glossaire. Rapport spécial sur les conséquences d’un réchauffement planétaire de 1,5 °C. [En ligne]. Genève, GIEC. [Consulté le 20/02/2026]. <URL : https://www.ipcc.ch/site/assets/uploads/sites/2/2019/10/SR15_Glossary_french.pdf>. @fr
was quoted from: Adapted from GIEC (2018) Glossaire. Rapport spécial sur les conséquences d’un réchauffement planétaire de 1,5 °C. [En ligne]. Genève, GIEC. [Consulté le 20/02/2026]. <URL : https://www.ipcc.ch/site/assets/uploads/sites/2/2019/10/SR15_Glossary_french.pdf>.

tactical fire
has status: Published
type: Concept
broader: ground intervention
definition: Backfiring or tactical burning operations as part of firefighting action against forest and wildland fires.
definition: Opération de contre feux ou des brûlages tactiques en action de lutte contre les feux de forêts et d’espaces naturels. @fr
in scheme: Thesaurus Multirisque FORESTT
preferred label: feu tactique @fr
was quoted from: Adapted from Valabre. Cadre feux tactiques (CFT). [En ligne]. Valabre, formations Feux de forêts et d’espaces naturels. [Consulté le 25/03/2026]. <URL : https://www.valabre.com/formations/feux-de-forets/cadre-feux-tactiques>
was quoted from: Adapté de Valabre. Cadre feux tactiques (CFT). [En ligne]. Valabre, formations Feux de forêts et d’espaces naturels. [Consulté le 25/03/2026]. <URL : https://www.valabre.com/formations/feux-de-forets/cadre-feux-tactiques> @fr

fuel management
has status: Published
type: Concept
alternative label: débroussaillement @fr
alternative label: fuel clearing
broader: silvicultural action
definition: Tout traitement des matières combustibles qui a pour résultat de diminuer la probabilité que les incendies y prennent naissance et s’y propagent. @fr
definition: Any treatment of combustible materials that results in reducing the probability of fires starting and spreading there.
in scheme: Thesaurus Multirisque FORESTT
preferred label: gestion du combustible @fr
was quoted from: Adapté de RNCan - Service canadien des forêts. Glossaire forestier : Sylviculture intensive. [En ligne]. 2019. [Consulté le 25/03/2026]. <URL : https://scf.rncan.gc.ca/termes/vue/578> @fr
was quoted from: Adapted from RNCan - Service canadien des forêts. Glossaire forestier : Sylviculture intensive. [En ligne]. 2019. [Consulté le 25/03/2026]. <URL : https://scf.rncan.gc.ca/termes/vue/578>

browsing
has status: Published
type: Concept
alternative label: herbivorie @fr
alternative label: herbivory
broader: mechanical destruction
definition: Prélèvement des bourgeons, des feuilles ou des pousses des espèces ligneuses ou semi-ligneuses dans un but alimentaire par des herbivores mammifères @fr
definition: Removal of buds, leaves or shoots of woody or semi-woody species for feeding purposes by mammalian herbivores.
in scheme: Thesaurus Multirisque FORESTT
preferred label: abroutissement @fr
was quoted from: Adapté de Plateforme Nationale Forêt-Gibier. Abroutissement. Fiches techniques Forêt & Gibier n° 646, septembre 2021, pp. 36-37. [En ligne]. GIP ATGeRi. [Consulté le 25/03/2026]. <URL : https://plateforme-nationale-foret-gibier.cartogip.fr/documents/FdF646-sept2021_p36-37_Abroutissement.pdf>. @fr
was quoted from: Adapted from Plateforme Nationale Forêt-Gibier. Abroutissement. Fiches techniques Forêt & Gibier n° 646, septembre 2021, pp. 36-37. [En ligne]. GIP ATGeRi. [Consulté le 25/03/2026]. <URL : https://plateforme-nationale-foret-gibier.cartogip.fr/documents/FdF646-sept2021_p36-37_Abroutissement.pdf>.

irregular workload for forestry work companies
has status: Published
type: Concept
broader: vulnerability of forestry work companies
definition: Vulnérabilité des entreprises de travaux forestiers liée aux variations fortes dà la hausse ou à la baisse de la charge de travail. @fr
definition: Vulnerability of forestry work companies related to strong upward or downward variations in workload.
in scheme: Thesaurus Multirisque FORESTT
preferred label: irrégularité de charge de travail pour les entreprises de travaux forestiers @fr
was quoted from: Groupe de travail « Thésaurus du multirisque en forêt » du projet X-RISKS du PEPR FORESTT (ANR-24-PEFO-0005). [En ligne]. <URL : https://www.pepr-forestt.fr/projets/pc-x-risks> @fr

use of repellents
has status: Published
type: Concept
broader: semiochemical treatment
definition: Utilisation de tout objet, méthode ou substance conçu dans le but d'éloigner des forêts les insectes ravageurs. @fr
definition: Use of any object, method or substance designed to keep pest insects away from forests.
in scheme: Thesaurus Multirisque FORESTT
preferred label: utilisation de répulsifs @fr
was quoted from: Adapté de AGROVOC. Répulsif. [En ligne]. FAO. [Consulté le 25/03/2026]. <URL : https://agrovoc.fao.org/browse/agrovoc/fr/page/c_6506> @fr
was quoted from: Adapted from AGROVOC. Répulsif. [En ligne]. FAO. [Consulté le 25/03/2026]. <URL : https://agrovoc.fao.org/browse/agrovoc/fr/page/c_6506>

road safety clearance
has status: Published
type: Concept
alternative label: sécurisation des voiries @fr
alternative label: road securing
broader: curative management, direct control
definition: Felling of damaged trees along roadsides to secure traffic for users.
definition: Coupes d'arbres sinistrés en bordure des voies pour sécuriser la circulation des usagers. @fr
in scheme: Thesaurus Multirisque FORESTT
preferred label: sécurisation des routes @fr
was quoted from: Adapted from Brunier et al. (Coord.) (2023) Guide de gestion des crises sanitaires en forêt. 2° édition. https://agriculture.gouv.fr/le-guide-de-gestion-des-crises-sanitaires-en-foret
was quoted from: Adapté de Brunier et al. (Coord.) (2023) Guide de gestion des crises sanitaires en forêt. 2° édition. https://agriculture.gouv.fr/le-guide-de-gestion-des-crises-sanitaires-en-foret @fr

extreme snowfall
has status: Published
type: Concept
broader: snow
definition: One of the most dangerous natural hazards in mountain regions, referring to episodes of snowfall or snow depth reaching exceptional maximum values, likely to cause significant human and economic damage (building overload and collapse, traffic disruption, avalanche triggering, contribution to flooding).
definition: Risque naturel parmi les plus dangereux en région montagneuse, désignant les épisodes de chutes de neige ou de hauteurs de neige qui atteignent des valeurs maximales exceptionnelles, susceptibles de provoquer des dommages humains et économiques importants (surcharge et effondrement de bâtiments, interruption du trafic, déclenchement d'avalanches, contribution aux inondations). @fr
in scheme: Thesaurus Multirisque FORESTT
preferred label: extrême neigeux @fr
was quoted from: Adapted from Nicolet (2019) Inférence et modélisation de la dépendance spatiale des extrêmes neigeux dans les Alpes françaises par processus max-stables. Thèse de doctorat, Université Grenoble Alpes, 2017. [En ligne]. [Consulté le 13/03/2026]. <URL : https://www.tandfonline.com/doi/pdf/10.1051/lhb/2019047>
was quoted from: Adapté de Nicolet (2019) Inférence et modélisation de la dépendance spatiale des extrêmes neigeux dans les Alpes françaises par processus max-stables. Thèse de doctorat, Université Grenoble Alpes, 2017. [En ligne]. [Consulté le 13/03/2026]. <URL : https://www.tandfonline.com/doi/pdf/10.1051/lhb/2019047> @fr

black swan event
has status: Published
type: Concept
alternative label: évènement cygne noir @fr
broader: qualitative risk assessment
definition: Refers to an unpredictable, rare and high-impact event that, once it has occurred, is rationalised after the fact as though it could have been anticipated. It illustrates the limits of predictive models and highlights the importance of preparedness for the unforeseeable.
definition: Désigne un événement imprévisible, rare et à impact majeur qui, une fois survenu, est rationalisé a posteriori comme s’il avait pu être anticipé. Il illustre la limite des modèles prédictifs et souligne l’importance de la préparation face à l’imprévisible. @fr
in scheme: Thesaurus Multirisque FORESTT
was quoted from: Adapted from IG. Théorie du cygne noir. [En ligne]. IG France - Stratégies de trading. [Consulté le 25/03/2026]. <URL : https://www.ig.com/fr/strategies-de-trading/Theorie-du-cygne-noir-200813>
was quoted from: Adapté de IG. Théorie du cygne noir. [En ligne]. IG France - Stratégies de trading. [Consulté le 25/03/2026]. <URL : https://www.ig.com/fr/strategies-de-trading/Theorie-du-cygne-noir-200813> @fr

open habitat management
has status: Published
type: Concept
broader: curative management, direct control
definition: Agencement des zones non arborées et des cloisonnements sylvicoles au voisinage des jeunes plantations. @fr
definition: Arrangement of unforested areas and silvicultural compartmentalisation in the vicinity of young plantations.
in scheme: Thesaurus Multirisque FORESTT
narrower: trackside verge maintenance
narrower: provision of alternative food resources
narrower: refuge zone management
preferred label: gestion des milieux ouverts @fr
was quoted from: Adapté de Marell et al. (2022) Risques environnementaux et ongulés sauvages : un sujet à multiples facettes. [Rapport de recherche] INRAE UR EFNO; INRAE UR CEFS. 2022, pp.44. [En ligne]. [Consulté le 25/03/2026]. <URL: https://hal.inrae.fr/hal-03630674>. @fr
was quoted from: Adapted from Marell et al. (2022) Risques environnementaux et ongulés sauvages : un sujet à multiples facettes. [Rapport de recherche] INRAE UR EFNO; INRAE UR CEFS. 2022, pp.44. [En ligne]. [Consulté le 25/03/2026]. <URL: https://hal.inrae.fr/hal-03630674>.

flood duration
has status: Published
type: Concept
broader: hazard characterisation
definition: Période mesurable pendant laquelle le débit d'eau reste supérieur au seuil de crue. @fr
definition: Measurable period during which water flow remains above the flood threshold.
in scheme: Thesaurus Multirisque FORESTT
preferred label: durée de la crue @fr
was quoted from: Adapté de Géorisques.gouv.fr. [En ligne]. Paris, Ministère de la Transition écologique. [Consulté le 20/02/2026]. <URL : https://www.georisques.gouv.fr/glossaire/debit>. @fr
was quoted from: Adapted from Géorisques.gouv.fr. [En ligne]. Paris, Ministère de la Transition écologique. [Consulté le 20/02/2026]. <URL : https://www.georisques.gouv.fr/glossaire/debit>.

flow rate
has status: Published
type: Concept
broader: hazard characterisation
definition: Volume d'eau qui traverse une section transversale d'un cours d'eau par unité de temps. Les débits des cours d'eau sont exprimés en m3/s. @fr
definition: Volume of water passing through a cross-section of a watercourse per unit of time. Watercourse flow rates are expressed in m3/s.
in scheme: Thesaurus Multirisque FORESTT
preferred label: débit de crue @fr
was quoted from: Adapté de Géorisques.gouv.fr. [En ligne]. Paris, Ministère de la Transition écologique. [Consulté le 20/02/2026]. <URL : https://www.georisques.gouv.fr/glossaire/debit> @fr
was quoted from: Adapted from Géorisques.gouv.fr. [En ligne]. Paris, Ministère de la Transition écologique. [Consulté le 20/02/2026]. <URL : https://www.georisques.gouv.fr/glossaire/debit>

powder avalanche
has status: Published
type: Concept
broader: avalanche
definition: Nuage turbulent de particules de neige en suspension dans l'air qui tend à aller, selon la ligne générale de la plus grande pente, en s'affranchissant souvent des variations topographiques locales. Sa vitesse maximale est nettement supérieure à 50 m/s. Sa masse volumique est de quelques dizaines de kg/m³ en moyenne. @fr
definition: Turbulent cloud of snow particles suspended in the air that tends to follow the general line of steepest slope, often disregarding local topographic variations. Its maximum speed is well above 50 m/s. Its density averages a few tens of kg/m³.
in scheme: Thesaurus Multirisque FORESTT
preferred label: avalanche en aérosol @fr
was quoted from: Adapté de Guide PPRN Avalanches. Ministère de la Transition écologique. [En ligne]. [Consulté le 03/06/2026]. <URL : https://www.ecologie.gouv.fr/sites/default/files/documents/guide%20PPR%20avalanches-correctif%20f%C3%A9vrier%202022(1).pdf> @fr
was quoted from: Adapted from Guide PPRN Avalanches. Ministère de la Transition écologique. [En ligne]. [Consulté le 03/06/2026]. <URL : https://www.ecologie.gouv.fr/sites/default/files/documents/guide%20PPR%20avalanches-correctif%20f%C3%A9vrier%202022(1).pdf>

exceptional edaphic drought
has status: Published
type: Concept
broader: edaphic drought
definition: Sécheresse du sol intense et longue induisant des dommages, voire des mortalités immédiates ou différées sur les arbres. Parmi les sécheresses édaphiques historiques, on compte 1976, 1989, 1990, 2003, 2005, 2015, 2018, 2019, et sans doute 2020 @fr
definition: Intense and prolonged soil drought inducing damage, or even immediate or delayed mortality in trees. Historic edaphic droughts include 1976, 1989, 1990, 2003, 2005, 2015, 2018, 2019, and probably 2020.
in scheme: Thesaurus Multirisque FORESTT
preferred label: sécheresse édaphique exceptionnelle @fr
was quoted from: Adapté de Observatoire des Forêts, indicateur 2.5 Proportion de la surface forestière affectée par la sécheresse. [En ligne]. [Consulté le 08/06/2026]. <URL : https://observatoire.foret.gouv.fr/themes/69d8f043b523ebb1cdb73383] @fr
was quoted from: Adapted from Observatoire des Forêts, indicateur 2.5 Proportion de la surface forestière affectée par la sécheresse. [En ligne]. [Consulté le 08/06/2026]. <URL : https://observatoire.foret.gouv.fr/themes/69d8f043b523ebb1cdb73383]

fire severity
has status: Published
type: Concept
broader: hazard characterisation
definition: Degree of modification or disturbance of a site by a fire, measured by the degree of biomass consumption and by the difficulty of ecosystem recovery.
definition: Degré de modification ou de perturbation d'un site par un incendie qui se mesure par le degré de consommation de la biomasse, et par les difficultés de récupération de l'écosystème. @fr
in scheme: Thesaurus Multirisque FORESTT
preferred label: sévérité du feu @fr

civil engineering measure
has status: Published
type: Concept
broader: physical protection
definition: Ouvrages de construction ou d'infrastructure pour la gestion et la prévention des risques naturels d'origine gravitaire : avalanches, crues torrentielles, glissements de terrain, chutes de blocs et éboulements, risques d’origine glaciaires et périglaciaires. @fr
definition: Construction or infrastructure works for the management and prevention of natural gravitational hazards: avalanches, torrential floods, landslides, rockfalls and rock slides, glacial and periglacial hazards.
in scheme: Thesaurus Multirisque FORESTT
preferred label: mesure de génie civil @fr
was quoted from: Adapté de United Nations. (2016). Report of the open-ended intergovernmental expert working group on indicators and terminology relating to disaster risk reduction (A/71/644). [En ligne]. [Consulté le 03/06/2026]. <URL : https://www.preventionweb.net/files/50683_oiewgreportenglish.pdf> @fr
was quoted from: Adapted from United Nations. (2016). Report of the open-ended intergovernmental expert working group on indicators and terminology relating to disaster risk reduction (A/71/644). [En ligne]. [Consulté le 03/06/2026]. <URL : https://www.preventionweb.net/files/50683_oiewgreportenglish.pdf>

forest sensitivity
has status: Published
type: Concept
broader: vulnerability of the forest
definition: Composante de la vulnérabilité. Mesure dans laquelle un écosystème forestier est affecté par l'exposition à un aléa @fr
definition: Component of vulnerability. Extent to which a forest ecosystem is affected by exposure to a hazard.
in scheme: Thesaurus Multirisque FORESTT
narrower: sensitivity related to species composition
narrower: species-specific sensitivity
narrower: genetic sensitivity of stand components
narrower: combustibility
narrower: fire resilience
narrower: fire resistance
preferred label: sensibilité de la forêt @fr
was quoted from: Adapté de GIEC (2018) Glossaire. [En ligne]. Genève, GIEC. [Consulté le 20/02/2026]. <URL : https://www.ipcc.ch/site/assets/uploads/sites/2/2019/10/SR15_Glossary_french.pdf @fr
was quoted from: Adapted from GIEC (2018) Glossaire. [En ligne]. Genève, GIEC. [Consulté le 20/02/2026]. <URL : https://www.ipcc.ch/site/assets/uploads/sites/2/2019/10/SR15_Glossary_french.pdf

wood-boring insect
has status: Published
type: Concept
alternative label: insecte lignivore @fr
alternative label: wood-eating insect
broader: branch and trunk pest insect
definition: Insecte se nourrissant des tissus du bois sain ou dépérissant. @fr
definition: Insect feeding on the tissue of healthy or declining wood.
in scheme: Thesaurus Multirisque FORESTT
narrower: bark-feeding insect
narrower: xylem-feeding insect
narrower: cambium-feeding insect
preferred label: insecte xylophage @fr
was quoted from: Adapté de Bouget et al. (2005) Nomenclature des groupes écologiques d’insectes liés au bois. [En ligne]. Paris, Comptes Rendus Biologies. [Consulté le 20/02/2026]. <URL : https://doi.org/10.1016/j.crvi.2005.08.003>. @fr
was quoted from: Adapted from Bouget et al. (2005) Nomenclature des groupes écologiques d’insectes liés au bois. [En ligne]. Paris, Comptes Rendus Biologies. [Consulté le 20/02/2026]. <URL : https://doi.org/10.1016/j.crvi.2005.08.003>.

depreciation of wood value
has status: Published
type: Concept
broader: economic loss for the company
definition: Baisse de la valeur marchande du bois. @fr
definition: Fall in the market value of wood.
in scheme: Thesaurus Multirisque FORESTT
preferred label: dépréciation de la valeur du bois @fr
was quoted from: Groupe de travail « Thésaurus du multirisque en forêt » du projet X-RISKS du PEPR FORESTT (ANR-24-PEFO-0005). [En ligne]. <URL : https://www.pepr-forestt.fr/projets/pc-x-risks> @fr

trampling
has status: Published
type: Concept
broader: mechanical destruction
definition: Soil compaction and seedling damage caused by trampling from large ungulates.
definition: Compactage du sol et dommages aux semis par piétinement des grands ongulés. @fr
in scheme: Thesaurus Multirisque FORESTT
preferred label: piétinement @fr
was quoted from: Groupe de travail « Thésaurus du multirisque en forêt » du projet X-RISKS du PEPR FORESTT (ANR-24-PEFO-0005). [En ligne]. <URL : https://www.pepr-forestt.fr/projets/pc-x-risks> @fr

risk level
has status: Published
type: Concept
broader: hyperparameter
definition: Risque de première espèce dans les modèles statistiques. @fr
definition: First-kind risk in statistical models.
in scheme: Thesaurus Multirisque FORESTT
narrower: spatio-temporal framework of risk measurement
preferred label: niveau de risque @fr
was quoted from: Groupe de travail « Thésaurus du multirisque en forêt » du projet X-RISKS du PEPR FORESTT (ANR-24-PEFO-0005). [En ligne]. <URL : https://www.pepr-forestt.fr/projets/pc-x-risks> @fr

root system waterlogging
has status: Published
modified: 2026-08-04T11:39:57.996
type: Concept
alternative label: excès d’eau dans le sol @fr
alternative label: ennoyage du système racinaire @fr
alternative label: excess soil water
alternative label: root system flooding
broader: natural hazard
definition: Toute partie d’un système racinaire située dans un sol engorgé. @fr
definition: Any part of a root system located in waterlogged soil.
in scheme: Thesaurus Multirisque FORESTT
preferred label: engorgement du système racinaire @fr
was quoted from: Adapté de Lévy et Lefèvre (2001). La forêt et sa culture sur sol à nappe temporaire : contraintes subies, choix des essences, interventions et gestion durable. ENGREF, Nancy, 223p. @fr
was quoted from: Adapted from Lévy et Lefèvre (2001). La forêt et sa culture sur sol à nappe temporaire : contraintes subies, choix des essences, interventions et gestion durable. ENGREF, Nancy, 223p.

reforestation
has status: Published
type: Concept
broader: silvicultural action
definition: Opération sylvicole recréant un nouvel état boisé, qui peut être différent de celui préexistant. @fr
definition: Silvicultural operation recreating a new wooded state, which may differ from the pre-existing one.
in scheme: Thesaurus Multirisque FORESTT
preferred label: reboisement @fr
was quoted from: Adapté de Communes forestières AURA & FAO. [En ligne]. [Consulté le 20/02/2026]. <URL : https://www.communesforestieres-aura.org/documents/ressources/63/2021-cofor63_guide_lexique.pdf>. @fr
was quoted from: Adapted from Communes forestières AURA & FAO. [En ligne]. [Consulté le 20/02/2026]. <URL : https://www.communesforestieres-aura.org/documents/ressources/63/2021-cofor63_guide_lexique.pdf>.

risk
has status: Published
type: Concept
definition: Éventualité de conséquences néfastes, dont l’occurrence ou l’ampleur sont incertaines, liées à un enjeu auquel les êtres humains attachent de la valeur. Résultat de l'interaction de la vulnérabilité (du socio-écosystème forestier concerné), de la durée d’exposition (à l’aléa), de l’aléa considéré et de sa probabilité d’occurrence. @fr
definition: The potential for adverse consequences, the occurrence or magnitude of which is uncertain, related to an asset to which human beings attach value. It results from the interaction of the vulnerability (of the forest socio-ecosystem concerned), the duration of exposure (to the hazard), the hazard considered and its probability of occurrence.
in scheme: Thesaurus Multirisque FORESTT
narrower: risk assessment
narrower: risk component
narrower: system of interest
narrower: risk scenario
preferred label: risque @fr
top concept of: Thesaurus Multirisque FORESTT
was quoted from: GIEC (2018) Glossaire. Rapport spécial sur les conséquences d’un réchauffement planétaire de 1,5 °C. [En ligne]. Genève, GIEC. [Consulté le 20/02/2026]. <URL : https://www.ipcc.ch/site/assets/uploads/sites/2/2019/10/SR15_Glossary_french.pdf>. @fr

sequential risks
has status: Published
type: Concept
broader: multi-risk
definition: Risques en interaction dans une dynamique temporelle. @fr
definition: Interacting risks within a temporal dynamic.
in scheme: Thesaurus Multirisque FORESTT
narrower: cascade effect
narrower: coupled effect
narrower: trigger
preferred label: risques en séquence @fr
was quoted from: Adapté de Curt (2020) Multirisque : quelles orientations de recherche dans les travaux récents ? [En ligne]. [Consulté le 20/02/2026]. <URL : https://hal.science/hal-03462813/document>. @fr
was quoted from: Adapted from Curt (2020) Multirisque : quelles orientations de recherche dans les travaux récents ? [En ligne]. [Consulté le 20/02/2026]. <URL : https://hal.science/hal-03462813/document>.

loss of recreational services
has status: Published
type: Concept
broader: loss of ecosystem service
definition: Diminution des services récréatifs rendus par la forêt d'un propriétaire, y compris celui lié à la location de la chasse. @fr
definition: Decrease in the recreational services provided by an owner's forest, including hunting lease income.
in scheme: Thesaurus Multirisque FORESTT
preferred label: perte de services récréatifs @fr
was quoted from: Groupe de travail « Thésaurus du multirisque en forêt » du projet X-RISKS du PEPR FORESTT (ANR-24-PEFO-0005). [En ligne]. <URL : https://www.pepr-forestt.fr/projets/pc-x-risks> @fr

social status of the tree
has status: Published
type: Concept
broader: sensitivity related to forest structure
definition: Position dominante, codominante, dominée ou surcimée d’un arbre dans le peuplement. @fr
definition: Dominant, codominant, suppressed or overtopped position of a tree within the stand.
in scheme: Thesaurus Multirisque FORESTT
narrower: suppressed tree
preferred label: statut social de l’arbre @fr
was quoted from: Adapté de SCF RNCan. Termes. [En ligne]. Ottawa, SCF RNCan. [Consulté le 20/02/2026]. <URL : https://scf.rncan.gc.ca/termes>. @fr
was quoted from: Adapted from SCF RNCan. Termes. [En ligne]. Ottawa, SCF RNCan. [Consulté le 20/02/2026]. <URL : https://scf.rncan.gc.ca/termes>.

extreme event
has status: Published
type: Concept
broader: qualitative risk assessment
definition: Manifestation of an extreme hazard at a given location over a given period of time, which may result in a disaster due to its conjunction with other risk factors such as exposure and vulnerability.
definition: Manifestation d’un aléa extrême en un lieu donné pendant une période de temps donnée, pouvant entraîner une catastrophe en raison de la conjonction avec d'autres facteurs de risque comme l'exposition et la vulnérabilité. @fr
in scheme: Thesaurus Multirisque FORESTT
preferred label: évènement extrême @fr
was quoted from: Adapted from United Nations Office for Disaster Risk Reduction (UNDRR). 2017. The Sendai Framework Terminology on Disaster Risk Reduction. "Hazardous event". Accessed 3 April 2026. https://www.undrr.org/terminology/hazardous-event.
was quoted from: Adapté de United Nations Office for Disaster Risk Reduction (UNDRR). 2017. The Sendai Framework Terminology on Disaster Risk Reduction. "Hazardous event". Accessed 3 April 2026. https://www.undrr.org/terminology/hazardous-event. @fr

xylem-feeding insect
has status: Published
type: Concept
broader: wood-boring insect
definition: Insecte se nourrissant des tissus internes du xylème. @fr
definition: Insect feeding on internal xylem tissue.
in scheme: Thesaurus Multirisque FORESTT
preferred label: insecte xylemophage @fr
was quoted from: Adapté de Bouget et al. (2005) Nomenclature des groupes écologiques d’insectes liés au bois. [En ligne]. Paris, Comptes Rendus Biologies. [Consulté le 20/02/2026]. <URL : https://doi.org/10.1016/j.crvi.2005.08.003>. @fr
was quoted from: Adapted from Bouget et al. (2005) Nomenclature des groupes écologiques d’insectes liés au bois. [En ligne]. Paris, Comptes Rendus Biologies. [Consulté le 20/02/2026]. <URL : https://doi.org/10.1016/j.crvi.2005.08.003>.

crisis timber
has status: Published
type: Concept
alternative label: produits accidentels @fr
alternative label: accidental products
broader: damage characterisation
definition: Récoltes non prévues, notamment dans les documents de gestion durable ou d'aménagement, qui s'imposent au gestionnaire pour des raisons sanitaires ou climatiques. @fr
definition: Unplanned harvests, in particular those set out in sustainable management or planning documents, which are imposed on the manager for sanitary or climatic reasons.
in scheme: Thesaurus Multirisque FORESTT
narrower: storm-damaged timber
narrower: burnt wood
preferred label: bois de crise @fr
was quoted from: Groupe de travail « Thésaurus du multirisque en forêt » du projet X-RISKS du PEPR FORESTT (ANR-24-PEFO-0005). [En ligne]. <URL : https://www.pepr-forestt.fr/projets/pc-x-risks> @fr

soil salinisation
has status: Published
type: Concept
broader: natural hazard
definition: Augmentation de la teneur en sels minéraux affectant négativement certains organismes du sol mais aussi la croissance des végétaux et pouvant rendre les sols improductifs et contaminer l’eau. @fr
definition: Increase in mineral salt content negatively affecting certain soil organisms as well as plant growth, and which can render soils unproductive and contaminate water.
in scheme: Thesaurus Multirisque FORESTT
preferred label: salinisation des sols @fr
was quoted from: AFES. Salinisation des sols. [En ligne]. [Consulté le 20/02/2026]. <URL : https://www.afes.fr/ressources/salinisation/>. @fr

sediment aggradation
has status: Published
type: Concept
broader: torrential hazard
definition: Accumulation de sédiments dans le lit d’un cours d’eau ou sur les berges suite à une crue. @fr
definition: Accumulation of sediment in a watercourse bed or on its banks following a flood.
in scheme: Thesaurus Multirisque FORESTT
preferred label: engravement @fr
was quoted from: Groupe de travail « Thésaurus du multirisque en forêt » du projet X-RISKS du PEPR FORESTT (ANR-24-PEFO-0005). [En ligne]. <URL : https://www.pepr-forestt.fr/projets/pc-x-risks> @fr

feedback from experience
has status: Published
type: Concept
broader: forest management for risk adaptation and management
definition: Procédure d'analyse des catastrophes pour améliorer les pratiques de gestion de crise futures. @fr
definition: Procedure for analysing disasters in order to improve future crisis management practices.
in scheme: Thesaurus Multirisque FORESTT
preferred label: retour d'expérience @fr
was quoted from: Adapté de Perchat & Rigolot (coord.) (2005) Comportement et utilisation des coupures de combustible - RCC n° 9. Éditions de la Cardère, 2005. [En ligne]. [Consulté le 25/03/2026]. <URL : https://cardere.fr/doc/RCC9.pdf> @fr
was quoted from: Adapted from Perchat & Rigolot (coord.) (2005) Comportement et utilisation des coupures de combustible - RCC n° 9. Éditions de la Cardère, 2005. [En ligne]. [Consulté le 25/03/2026]. <URL : https://cardere.fr/doc/RCC9.pdf>

outbreak
type: Concept
broader: hazard characterisation
definition: Rapid and significant increase in the abundance of a harmful organism or its effects within a population or territory.
definition: Augmentation rapide et importante de l'abondance d'un organisme nuisible ou de ses effets au sein d'une population ou d'un territoire. @fr
in scheme: Thesaurus Multirisque FORESTT
preferred label: pullulation @fr
was quoted from: Groupe de travail « Thésaurus du multirisque en forêt » du projet X-RISKS du PEPR FORESTT (ANR-24-PEFO-0005). [En ligne]. <URL : https://www.pepr-forestt.fr/projets/pc-x-risks> @fr

species mixing
has status: Published
type: Concept
alternative label: diversification forestière @fr
alternative label: forest diversification
broader: choice of species
definition: Diversification par l'association de plusieurs espèces dans un même peuplement. @fr
definition: Diversification through the combination of several species within the same stand.
in scheme: Thesaurus Multirisque FORESTT
preferred label: mélange d'essences @fr
was quoted from: Adapté de INRAE. Adaptation, les pistes d’action. INRAE, dossier « Quelles gestions des forêts pour demain ? », 21 juin 2022. [En ligne]. [Consulté le 25/03/2026]. <URL : https://www.inrae.fr/dossiers/quelles-gestions-forets-demain/adaptation-pistes-daction> @fr
was quoted from: Adapted from INRAE. Adaptation, les pistes d’action. INRAE, dossier « Quelles gestions des forêts pour demain ? », 21 juin 2022. [En ligne]. [Consulté le 25/03/2026]. <URL : https://www.inrae.fr/dossiers/quelles-gestions-forets-demain/adaptation-pistes-daction>

choice of less fire-vulnerable species
has status: Published
type: Concept
broader: choice of species
definition: Sélection d'essences forestières plus résistantes ou plus résilientes au feu, ou constituant des formations moins combustibles. @fr
definition: Selection of forest species that are more fire-resistant or fire-resilient, or that form less flammable stands.
in scheme: Thesaurus Multirisque FORESTT
preferred label: choix d’essences moins vulnérables au feu @fr
was quoted from: Adapté de Revertegat et al. (2025) Synthèse sur la vulnérabilité des peuplements forestiers au feu. Rapport final du projet AFORCE VULNEFEU (Vulnefeu04). [En ligne]. Réseau AFORCE, 2025. [Consulté le 25/03/2026]. <URL : https://www.reseau-aforce.fr/sites/reseau-aforce/files/2025-07/Rapport-Vulnefeu04-compressed.pdf @fr
was quoted from: Adapted from Revertegat et al. (2025) Synthèse sur la vulnérabilité des peuplements forestiers au feu. Rapport final du projet AFORCE VULNEFEU (Vulnefeu04). [En ligne]. Réseau AFORCE, 2025. [Consulté le 25/03/2026]. <URL : https://www.reseau-aforce.fr/sites/reseau-aforce/files/2025-07/Rapport-Vulnefeu04-compressed.pdf

regulatory measure
has status: Published
type: Concept
broader: response to protect the forest
definition: Mesure liée à une règle ou une directive établie et appliquée par une autorité publique dans le domaine de la forêt. @fr
definition: Measure related to a rule or directive established and applied by a public authority in the field of forestry.
in scheme: Thesaurus Multirisque FORESTT
narrower: designated establishment with respect to the nematode
narrower: quarantine organism
narrower: national emergency health intervention plan (PNISU) for Bursaphelenchus xylophilus (pine wood nematode)
narrower: ISPM 15 phytosanitary standard
narrower: national FRM regulation
narrower: incentive for silviculture in protection forests
narrower: regulatory classification of forests
narrower: foreseeable natural risk prevention plan
narrower: plant passport
narrower: forest massif plan for protection against fires (PMPFCI)
narrower: legal obligation to clear vegetation
narrower: departmental forest fire protection plan (PDPFCI)
narrower: regulation of access to forest massifs
narrower: characterise browsing pressure
narrower: setting hunting pressure levels to apply
preferred label: mesure réglementaire @fr
was quoted from: Adapté de AGROVOC. Réglementation. [En ligne]. FAO. [Consulté le 25/03/2026]. <URL : https://agrovoc.fao.org/browse/agrovoc/fr/page/c_6493> @fr
was quoted from: Adapted from AGROVOC. Réglementation. [En ligne]. FAO. [Consulté le 25/03/2026]. <URL : https://agrovoc.fao.org/browse/agrovoc/fr/page/c_6493>

characterisation of damage to the forest
has status: Published
type: Concept
alternative label: forest damage
alternative label: dégât à la forêt @fr
alternative label: perte pour la forêt @fr
alternative label: loss to the forest
broader: risk to the forest
definition: Préjudice ou perte pour la forêt, observé ou prédit, lié à la réalisation ou à la projection des impacts causés par un aléa. @fr
definition: Observed or predicted harm or loss to the forest, linked to the occurrence or projection of impacts caused by a hazard.
in scheme: Thesaurus Multirisque FORESTT
narrower: damage characterisation
preferred label: caractérisation des dommages à la forêt @fr
was quoted from: Adapté de GIEC (2018) Glossaire. [En ligne]. Genève, GIEC. [Consulté le 20/02/2026]. <URL : https://www.ipcc.ch/site/assets/uploads/sites/2/2019/10/SR15_Glossary_french.pdf>. @fr
was quoted from: Adapted from GIEC (2018) Glossaire. [En ligne]. Genève, GIEC. [Consulté le 20/02/2026]. <URL : https://www.ipcc.ch/site/assets/uploads/sites/2/2019/10/SR15_Glossary_french.pdf>.

piercing-sucking insect
has status: Published
type: Concept
broader: foliage pest insect
definition: Organisme aspirant les sucs des plantes par un appareil buccal spécialisé, ce qui occasionne des déformations aux plantes et peut causer la mort des parties affectées. @fr
definition: Organism sucking plant sap through a specialised mouthpart, causing plant deformation and potentially death of the affected parts.
in scheme: Thesaurus Multirisque FORESTT
preferred label: piqueur-suceur @fr
was quoted from: Adapté de SCF RNCan. Termes. [En ligne]. Ottawa, SCF RNCan. [Consulté le 20/02/2026]. <URL : https://scf.rncan.gc.ca/termes>. @fr
was quoted from: Adapted from SCF RNCan. Termes. [En ligne]. Ottawa, SCF RNCan. [Consulté le 20/02/2026]. <URL : https://scf.rncan.gc.ca/termes>.

extreme value theory
has status: Published
type: Concept
broader: risk measure
definition: Théorie qui fournit un cadre théorique et pratique pour modéliser, estimer et gérer les événements rares et quantifier les risques liés aux extrêmes. @fr
definition: Theory that provides a theoretical and practical framework for modelling, estimating and managing rare events and quantifying risks related to extremes.
in scheme: Thesaurus Multirisque FORESTT
preferred label: théorie des valeurs extrêmes @fr
was quoted from: Adapté de Roncalli (2002) Théorie des valeurs extrêmes ou modélisation des événements rares pour la gestion des risques. Notes de cours DESS 203, Université Paris IX Dauphine. [En ligne]. [Consulté le 25/03/2026]. <URL : http://www.thierry-roncalli.com/download/Lecture-Notes-Evt-Dauphine.pdf> @fr
was quoted from: Adapted from Roncalli (2002) Théorie des valeurs extrêmes ou modélisation des événements rares pour la gestion des risques. Notes de cours DESS 203, Université Paris IX Dauphine. [En ligne]. [Consulté le 25/03/2026]. <URL : http://www.thierry-roncalli.com/download/Lecture-Notes-Evt-Dauphine.pdf>

bark stripping
has status: Published
type: Concept
broader: mechanical destruction
definition: Removal of a tree's bark through the tearing off of small strips by deer for feeding.
definition: Enlèvement de l’écorce d’un arbre par l’arrachage de petites lanières par les cervidés pour se nourrir. @fr
in scheme: Thesaurus Multirisque FORESTT
preferred label: écorçage @fr
was quoted from: Adapté de RNCan - Service canadien des forêts. Glossaire forestier : Sylviculture intensive. [En ligne]. 2019. [Consulté le 25/03/2026]. <URL : https://scf.rncan.gc.ca/termes/vue/207> @fr
was quoted from: Adapted from RNCan - Service canadien des forêts. Glossaire forestier : Sylviculture intensive. [En ligne]. 2019. [Consulté le 25/03/2026]. <URL : https://scf.rncan.gc.ca/termes/vue/207>

sensitivity related to silviculture
has status: Published
type: Concept
broader: forest sensitivity related to human actions
definition: Extent to which a forest stand is affected by a hazard due to the silviculture practised there.
definition: Mesure dans laquelle un peuplement forestier est affecté par un aléa du fait de la sylviculture qui y est pratiquée. @fr
in scheme: Thesaurus Multirisque FORESTT
narrower: clear-cutting
narrower: forest-wild ungulate imbalance
narrower: soil compaction
narrower: poorly managed stand
preferred label: sensibilité liée à la sylviculture @fr
was quoted from: Groupe de travail « Thésaurus du multirisque en forêt » du projet X-RISKS du PEPR FORESTT (ANR-24-PEFO-0005). [En ligne]. <URL : https://www.pepr-forestt.fr/projets/pc-x-risks> @fr

safety fuel-clearance strip
has status: Published
type: Concept
broader: silvicultural action
definition: Fuel break intended to provide adequate safety conditions for vehicle transit on roads affected by a fire.
definition: Coupure de combustible destinée à apporter des conditions de sécurité correctes pour le transit des véhicules sur des voies de circulation affectées par un incendie. @fr
in scheme: Thesaurus Multirisque FORESTT
preferred label: bande débroussaillée de sécurité @fr
was quoted from: Adapted from Rigolot & Costa (coord.) (2000) Conception des coupures de combustible. Réseau Coupures de combustible RCC n°4, 2000. [En ligne]. Éditions de la Cardère. [Consulté le 01/04/2026]. <URL : https://cardere.fr/doc/RCC4.pdf>
was quoted from: Adapté de Rigolot & Costa (coord.) (2000) Conception des coupures de combustible. Réseau Coupures de combustible RCC n°4, 2000. [En ligne]. Éditions de la Cardère. [Consulté le 01/04/2026]. <URL : https://cardere.fr/doc/RCC4.pdf> @fr

danger zone
has status: Published
type: Concept
broader: forest fire hazard mapping
definition: Area exposed to high or very high forest and vegetation fire danger, delimited by the Prefect, and constituting a public utility easement.
definition: Zone exposée à un danger élevé ou très élevé de feux de forêt et de végétation délimitée par le Préfet, et constituant une servitude d'utilité publique. @fr
in scheme: Thesaurus Multirisque FORESTT
preferred label: zone de danger @fr
was quoted from: Adapted from Décret n° 2024-405 du 29 avril 2024 relatif à la prévention des feux de forêt. [En ligne]. Légifrance. [Consulté le 25/03/2026]. <URL : https://www.legifrance.gouv.fr/jorf/id/JORFTEXT000049491011>
was quoted from: Adapté de Décret n° 2024-405 du 29 avril 2024 relatif à la prévention des feux de forêt. [En ligne]. Légifrance. [Consulté le 25/03/2026]. <URL : https://www.legifrance.gouv.fr/jorf/id/JORFTEXT000049491011> @fr

exposed forest operator
has status: Published
type: Concept
alternative label: trader
alternative label: négociant @fr
broader: exposed actor of the forest-wood sector
definition: Forest operator likely to suffer damage due to exposure to hazards.
definition: Exploitant forestier susceptible de subir des dommages, du fait de son exposition à des aléas. @fr
in scheme: Thesaurus Multirisque FORESTT
preferred label: exploitant forestier exposé @fr
was quoted from: Groupe de travail « Thésaurus du multirisque en forêt » du projet X-RISKS du PEPR FORESTT (ANR-24-PEFO-0005). [En ligne]. <URL : https://www.pepr-forestt.fr/projets/pc-x-risks> @fr

forest massif plan for protection against fires (PMPFCI)
has status: Published
type: Concept
alternative label: plan intercommunal de débroussaillement et d’aménagement forestier (pidaf) @fr
alternative label: intercommunal plan for fuel clearing and forest development (PIDAF)
broader: regulatory measure
definition: Document de planification relatif à l’aménagement et à l’équipement d’un massif forestier en vue de prévenir les risques d’incendies et de lutter contre eux de manière efficace. @fr
definition: Planning document relating to the development and equipping of a forest massif with a view to preventing fire risks and fighting them effectively.
in scheme: Thesaurus Multirisque FORESTT
preferred label: plan de massif pour la protection des forêts contre les incendies (PMPFCI) @fr
was quoted from: Adapté de CNPF PACA. PIDAF : définition, valeur juridique et durée. [En ligne]. Avril 2022. [Consulté le 25/03/2026]. <URL : https://paca.cnpf.fr/sites/paca/files/2022-04/312201_pidaf_definition_valeur_juridique_duree.pdf> @fr
was quoted from: Adapted from CNPF PACA. PIDAF : définition, valeur juridique et durée. [En ligne]. Avril 2022. [Consulté le 25/03/2026]. <URL : https://paca.cnpf.fr/sites/paca/files/2022-04/312201_pidaf_definition_valeur_juridique_duree.pdf>

non-forest asset at risk
has status: Published
type: Concept
broader: risk to the forest
definition: Élément non forestier exposé à un aléa touchant la forêt et susceptible de subir des dommages. @fr
definition: Non-forest element exposed to a hazard affecting the forest and likely to suffer damage.
in scheme: Thesaurus Multirisque FORESTT
narrower: transport sector
narrower: human asset at risk
narrower: urban planning sector
narrower: critical infrastructure
narrower: energy sector
preferred label: enjeu non forestier @fr
was quoted from: Adapté de GIEC (2018) Glossaire. [En ligne]. Genève, GIEC. [Consulté le 20/02/2026]. <URL : https://www.ipcc.ch/site/assets/uploads/sites/2/2019/10/SR15_Glossary_french.pdf>. @fr
was quoted from: Adapted from GIEC (2018) Glossaire. [En ligne]. Genève, GIEC. [Consulté le 20/02/2026]. <URL : https://www.ipcc.ch/site/assets/uploads/sites/2/2019/10/SR15_Glossary_french.pdf>.

risk management measure
has status: Published
type: Concept
alternative label: réponse @fr
alternative label: response
alternative label: solution
broader: risk management
definition: Action visant soit à supprimer le risque en éliminant la cause, soit à le réduire en diminuant sa probabilité d’occurrence ou son impact en agissant sur l'aléa, la vulnérabilité ou l'exposition des enjeux, soit à le transférer vers un tiers. @fr
definition: Action aimed either at eliminating the risk by removing its cause, or at reducing it by decreasing its probability of occurrence or its impact by acting on the hazard, vulnerability or exposure of assets, or at transferring it to a third party.
in scheme: Thesaurus Multirisque FORESTT
preferred label: mesure de gestion du risque @fr
was quoted from: Adapté de AGROVOC - FAO. Gestion des risques (risk management). [En ligne]. FAO. [Consulté le 25/03/2026]. <URL : https://agrovoc.fao.org/browse/agrovoc/fr/page/c_37934> @fr
was quoted from: Adapted from AGROVOC - FAO. Gestion des risques (risk management). [En ligne]. FAO. [Consulté le 25/03/2026]. <URL : https://agrovoc.fao.org/browse/agrovoc/fr/page/c_37934>

avalanche intensity
has status: Published
type: Concept
broader: hazard characterisation
definition: Vitesse, volume et densité d’une avalanche. @fr
definition: Speed, volume and density of an avalanche.
in scheme: Thesaurus Multirisque FORESTT
preferred label: intensité de l’avalanche @fr
was quoted from: Adapté de Guide PPRN Avalanches. Ministère de la Transition écologique. [En ligne]. [Consulté le 03/06/2026]. <URL : https://www.ecologie.gouv.fr/sites/default/files/documents/guide%20PPR%20avalanches-correctif%20f%C3%A9vrier%202022(1).pdf> @fr
was quoted from: Adapted from Guide PPRN Avalanches. Ministère de la Transition écologique. [En ligne]. [Consulté le 03/06/2026]. <URL : https://www.ecologie.gouv.fr/sites/default/files/documents/guide%20PPR%20avalanches-correctif%20f%C3%A9vrier%202022(1).pdf>

low or impossible post-fire germination
has status: Published
type: Concept
broader: natural regeneration deficit
definition: Difficulté de régénération post-incendie du fait d'une faible capacité de germination. @fr
definition: Post-fire regeneration difficulty due to low germination capacity.
in scheme: Thesaurus Multirisque FORESTT
preferred label: germination post feu faible ou impossible @fr
was quoted from: Adapté de Revertegat et al. (2025) Synthèse sur la vulnérabilité des peuplements forestiers au feu. Rapport final du projet AFORCE VULNEFEU (Vulnefeu04). [En ligne]. Réseau AFORCE, 2025. [Consulté le 25/03/2026]. <URL : https://www.reseau-aforce.fr/sites/reseau-aforce/files/2025-07/Rapport-Vulnefeu04-compressed.pdf @fr
was quoted from: Adapted from Revertegat et al. (2025) Synthèse sur la vulnérabilité des peuplements forestiers au feu. Rapport final du projet AFORCE VULNEFEU (Vulnefeu04). [En ligne]. Réseau AFORCE, 2025. [Consulté le 25/03/2026]. <URL : https://www.reseau-aforce.fr/sites/reseau-aforce/files/2025-07/Rapport-Vulnefeu04-compressed.pdf

glacial hazard
has status: Published
type: Concept
broader: gravitational hazard
definition: Aléa naturel en montagne ayant pour source des zones couvertes de glace ou leurs abords directement influencés par la présence des glaciers, ou concernés par le dégel des sols gelés en permanence en profondeur (permafrost). @fr
definition: Natural mountain hazard originating from areas covered by ice or their surroundings directly influenced by the presence of glaciers, or affected by the thawing of permanently frozen ground in depth (permafrost).
in scheme: Thesaurus Multirisque FORESTT
preferred label: aléa d’origine glaciaire @fr
was quoted from: Adapté de Lacroix et al. (2022). Risques d’origine glaciaire et périglaciaire - Éléments en soutien à un plan d’action. Rapport IGEDD, décembre 2022. [En ligne]. [Consulté le 03/06/2026]. <URL : https://www.enseignementsup-recherche.gouv.fr/sites/default/files/2023-08/rapport-21-22-315a-28938.pdf> @fr
was quoted from: Adapted from Lacroix et al. (2022). Risques d’origine glaciaire et périglaciaire - Éléments en soutien à un plan d’action. Rapport IGEDD, décembre 2022. [En ligne]. [Consulté le 03/06/2026]. <URL : https://www.enseignementsup-recherche.gouv.fr/sites/default/files/2023-08/rapport-21-22-315a-28938.pdf>

exceptional atmospheric drought
has status: Published
type: Concept
broader: atmospheric drought
definition: Extremely prolonged rainfall deficit.
definition: Déficit extrêmement prolongé de précipitations @fr
in scheme: Thesaurus Multirisque FORESTT
preferred label: sécheresse atmosphérique exceptionnelle @fr
was quoted from: Adapted from Shekhar et al. (2023). Long-term changes in forest response to extreme atmospheric dryness. Global Change Biology, 29(18), pp. 5379-5396. [En ligne]. [Consulté le 03/06/2026]. <URL : https://doi.org/10.1111/gcb.16846>
was quoted from: Adapté de Shekhar et al. (2023). Long-term changes in forest response to extreme atmospheric dryness. Global Change Biology, 29(18), pp. 5379-5396. [En ligne]. [Consulté le 03/06/2026]. <URL : https://doi.org/10.1111/gcb.16846> @fr

sensitivity related to forest structure
has status: Published
type: Concept
broader: sensitivity related to soil-climate conditions
definition: Mesure dans laquelle un peuplement forestier est affecté par un aléa du fait de sa structure propre. @fr
definition: Extent to which a forest stand is affected by a hazard due to its own structure.
in scheme: Thesaurus Multirisque FORESTT
narrower: stand density
narrower: social status of the tree
narrower: high combustibility
narrower: stand age
narrower: stand structure
preferred label: sensibilité liée à la structure forestière @fr
was quoted from: Groupe de travail « Thésaurus du multirisque en forêt » du projet X-RISKS du PEPR FORESTT (ANR-24-PEFO-0005). [En ligne]. <URL : https://www.pepr-forestt.fr/projets/pc-x-risks> @fr

land use planning
has status: Published
type: Concept
broader: change in legislation
definition: Modification de la législation et de la réglementation dans le domaine de l'urbanisme qui impacte la filière forêt-bois. @fr
definition: Changes in legislation and regulations in the field of urban planning that impact the forest-wood sector.
in scheme: Thesaurus Multirisque FORESTT
narrower: prioritisation for other sectors
preferred label: aménagement du territoire @fr
was quoted from: Adapté de Géoconfluences. Aménagement du territoire (et aménagement des territoires). [En ligne]. ENS Lyon. [Consulté le 03/06/2026]. <URL : https://geoconfluences.ens-lyon.fr/glossaire/amenagement-du-territoire> @fr
was quoted from: Adapted from Géoconfluences. Aménagement du territoire (et aménagement des territoires). [En ligne]. ENS Lyon. [Consulté le 03/06/2026]. <URL : https://geoconfluences.ens-lyon.fr/glossaire/amenagement-du-territoire>

loss of assets
has status: Published
type: Concept
broader: economic loss for the forest owner
definition: Decrease in the value of a forest owner's assets.
definition: Diminution de la valeur du patrimoine d'un propriétaire forestier. @fr
in scheme: Thesaurus Multirisque FORESTT
preferred label: perte en patrimoine @fr
was quoted from: Groupe de travail « Thésaurus du multirisque en forêt » du projet X-RISKS du PEPR FORESTT (ANR-24-PEFO-0005). [En ligne]. <URL : https://www.pepr-forestt.fr/projets/pc-x-risks> @fr

fire outbreak surveillance
has status: Published
type: Concept
alternative label: détection des feux @fr
alternative label: fire detection
broader: monitoring
definition: Operation to detect and locate fire starts.
definition: Opération de détection et localisation des départs d'incendies @fr
in scheme: Thesaurus Multirisque FORESTT
narrower: fire cause and circumstance investigation (RCCI)
preferred label: surveillance des éclosions d’incendie @fr

economic loss for the company
has status: Published
type: Concept
broader: economic loss
definition: Dégradation de l'activité économique que ce soit en termes de production, d'emploi, ou de croissance d'un acteur de la filière forêt-bois. @fr
definition: Deterioration of economic activity, whether in terms of production, employment, or growth of a forest-wood sector actor.
in scheme: Thesaurus Multirisque FORESTT
narrower: short-time working
narrower: depreciation of wood value
narrower: non-compliance with the wood use hierarchy
narrower: insolvency filing
preferred label: perte économique de l'entreprise @fr
was quoted from: Groupe de travail « Thésaurus du multirisque en forêt » du projet X-RISKS du PEPR FORESTT (ANR-24-PEFO-0005). [En ligne]. <URL : https://www.pepr-forestt.fr/projets/pc-x-risks> @fr

bark susceptible to pine wood nematode
has status: Published
type: Concept
broader: sensitive host
definition: Écorce pouvant héberger ou transmettre le nématode du pin. @fr
definition: Bark capable of harbouring or transmitting the pine wood nematode.
in scheme: Thesaurus Multirisque FORESTT
preferred label: écorce sensible au nématode du pin @fr
was quoted from: Adapté de Plan national d'intervention sanitaire d'urgence relatif à Bursaphelenchus xylophilus (nématode du pin). [En ligne]. [Consulté le 20/02/2026]. <URL : https://info.agriculture.gouv.fr/boagri/instruction-2019-209>. @fr
was quoted from: Adapted from Plan national d'intervention sanitaire d'urgence relatif à Bursaphelenchus xylophilus (nématode du pin). [En ligne]. [Consulté le 20/02/2026]. <URL : https://info.agriculture.gouv.fr/boagri/instruction-2019-209>.

excessive specialisation of forestry work companies
has status: Published
type: Concept
broader: vulnerability of forestry work companies
definition: Vulnerability of forestry work companies related to excessive specialisation of their activity, reducing their ability to adapt to market fluctuations.
definition: Vulnérabilité des entreprises de travaux forestiers liée à une spécialisation excessive de leur activité, réduisant leur adaptation aux fluctuations du marché. @fr
in scheme: Thesaurus Multirisque FORESTT
preferred label: trop forte spécialisation des entreprises de travaux forestiers @fr
was quoted from: Groupe de travail « Thésaurus du multirisque en forêt » du projet X-RISKS du PEPR FORESTT (ANR-24-PEFO-0005). [En ligne]. <URL : https://www.pepr-forestt.fr/projets/pc-x-risks> @fr

surface fire
has status: Published
type: Concept
broader: hazard characterisation
definition: A fire that burns litter, grasses and low shrubs.
definition: Un feu qui brûle la litière, les herbes et les arbustes bas. @fr
in scheme: Thesaurus Multirisque FORESTT
preferred label: feu de surface @fr

quantitative risk assessment
has status: Published
type: Concept
broader: risk assessment
definition: Approche quantitative d'estimation des risques. @fr
definition: Quantitative approach to risk estimation.
in scheme: Thesaurus Multirisque FORESTT
narrower: risk measure
preferred label: évaluation quantitative du risque @fr
was quoted from: Adapté de UNDRR. "Disaster risk assessment". Sendai Framework Terminology on Disaster Risk Reduction. [En ligne]. United Nations Office for Disaster Risk Reduction. [Consulté le 03/06/2026]. <URL : https://www.undrr.org/terminology/disaster-risk-assessment> @fr
was quoted from: Adapted from UNDRR. "Disaster risk assessment". Sendai Framework Terminology on Disaster Risk Reduction. [En ligne]. United Nations Office for Disaster Risk Reduction. [Consulté le 03/06/2026]. <URL : https://www.undrr.org/terminology/disaster-risk-assessment>

lightning
has status: Published
type: Concept
broader: natural hazard
definition: Un éclair qui atteint soit la surface terrestre, soit un aéronef. @fr
definition: A lightning strike reaching either the earth's surface or an aircraft.
in scheme: Thesaurus Multirisque FORESTT
preferred label: foudre @fr

génétique
type: Collection
in scheme: Thesaurus Multirisque FORESTT
member: pure stand with low genetic diversity
member: prevention through genetics
member: genotype mixing
member: genetic selection for resistance
member: non-viable population size
member: varietal mixture
member: genotype mixing through planting
member: genotype mixing favoured by silviculture
member: amendment of the regionalised list of FRM eligible for state aid
member: genetic enrichment

trunk charring
has status: Published
type: Concept
broader: damage characterisation
definition: Charring of a tree trunk's bark caused by the passage of the flame front during a fire.
definition: Carbonisation de l'écorce du tronc d'un arbre, provoqué par le passage du front de flamme lors d'un incendie. @fr
in scheme: Thesaurus Multirisque FORESTT
preferred label: carbonisation du tronc @fr
was quoted from: Adapted from Rigolot (2004) Predicting postfire mortality of Pinus halepensis Mill. and Pinus pinea L. Plant Ecology, 2004, vol. 171, pp. 139-151. [En ligne]. HAL open science, hal-02674211. [Consulté le 25/03/2026]. <URL : https://hal.inrae.fr/hal-02674211>
was quoted from: Adapté de Rigolot (2004) Predicting postfire mortality of Pinus halepensis Mill. and Pinus pinea L. Plant Ecology, 2004, vol. 171, pp. 139-151. [En ligne]. HAL open science, hal-02674211. [Consulté le 25/03/2026]. <URL : https://hal.inrae.fr/hal-02674211> @fr

xeric site
has status: Published
type: Concept
broader: weather characteristic
definition: Station sèche et chaude favorable aux espèces adaptées à la sécheresse. @fr
definition: Dry and warm site favourable to drought-adapted species.
in scheme: Thesaurus Multirisque FORESTT
preferred label: station xérique @fr
was quoted from: Groupe de travail « Thésaurus du multirisque en forêt » du projet X-RISKS du PEPR FORESTT (ANR-24-PEFO-0005). [En ligne]. <URL : https://www.pepr-forestt.fr/projets/pc-x-risks> @fr

damage characterisation
has status: Published
type: Concept
broader: characterisation of damage to the forest
definition: Description quantitative et qualitative des dommages. @fr
definition: Quantitative and qualitative description of damage.
in scheme: Thesaurus Multirisque FORESTT
narrower: crisis timber
narrower: lesion size
narrower: canker size
narrower: fine root loss
narrower: loss of wood quality
narrower: growth loss
narrower: contaminated tree
narrower: mechanical destruction
narrower: loss of regulating ecosystem service
narrower: loss of cultural ecosystem service
narrower: growth cessation
narrower: loss of provisioning service
narrower: loss of supporting ecosystem service
narrower: grey stage
narrower: severity
narrower: damage frequency
narrower: mortality
narrower: income loss
narrower: root damage
narrower: foliage scorch
narrower: trunk charring
narrower: wood boring
narrower: leaf desiccation
narrower: lightning damage
narrower: defoliated tree
narrower: decline
narrower: cavitation
narrower: trunk damage
narrower: collar damage
narrower: red stage
narrower: critical wind speed
preferred label: caractérisation des dommages @fr
was quoted from: Adapté de INRAE. Anatomie du risque (Infographie). [En ligne]. [Consulté le 20/02/2026]. <URL : https://www.inrae.fr/sites/default/files/ressources7_infographie_anatomie_du_risque.pdf>. @fr
was quoted from: Adapted from INRAE. Anatomie du risque (Infographie). [En ligne]. [Consulté le 20/02/2026]. <URL : https://www.inrae.fr/sites/default/files/ressources7_infographie_anatomie_du_risque.pdf>.

exposed actor of primary processing
has status: Published
type: Concept
broader: exposed actor of the forest-wood sector
definition: Actor of primary processing (sawing, planing, panel manufacturing and pulp production...) likely to suffer damage due to exposure to hazards.
definition: Acteur de la première transformation (sciage, rabotage, fabrication de panneaux et production de pâte à papier ...) susceptible de subir des dommages, du fait de son exposition à des aléas. @fr
in scheme: Thesaurus Multirisque FORESTT
preferred label: acteur exposé de la première transformation @fr
was quoted from: Groupe de travail « Thésaurus du multirisque en forêt » du projet X-RISKS du PEPR FORESTT (ANR-24-PEFO-0005). [En ligne]. <URL : https://www.pepr-forestt.fr/projets/pc-x-risks> @fr

multi-pheromone attractant
has status: Published
type: Concept
alternative label: baited trap
alternative label: generic attractant
alternative label: attractif générique @fr
alternative label: piège appâté @fr
broader: early detection
definition: Stimulus chimique attirant plusieurs espèces d'insectes ravageurs des forêts pour piégeage. @fr
definition: Chemical stimulus attracting several species of forest pest insects for trapping.
in scheme: Thesaurus Multirisque FORESTT
preferred label: attractif multi-phéromones @fr
was quoted from: Adapté de RNCan - Service canadien des forêts. Glossaire forestier : Sylviculture intensive. [En ligne]. 2019. [Consulté le 25/03/2026]. <URL : https://scf.rncan.gc.ca/termes/vue/875> @fr
was quoted from: Adapted from RNCan - Service canadien des forêts. Glossaire forestier : Sylviculture intensive. [En ligne]. 2019. [Consulté le 25/03/2026]. <URL : https://scf.rncan.gc.ca/termes/vue/875>

vulnerability of support services
has status: Published
type: Concept
broader: vulnerability of the wood sector
definition: Propension ou prédisposition des services d'appui à la filière forêt-bois (organismes et entreprises de service, de conseil et recherche) à subir des pertes. Notion englobant divers concepts et éléments, tels que la sensibilité ou la fragilité et l’incapacité de faire face et de s’adapter. @fr
definition: Propensity or predisposition of forest-wood sector support services (service, advisory and research organisations and companies) to suffer losses. A notion encompassing various concepts and elements, such as sensitivity or fragility and the inability to cope and adapt.
in scheme: Thesaurus Multirisque FORESTT
narrower: lack of staff for support services
preferred label: vulnérabilité des services d'appui @fr
was quoted from: Adapté de GIEC (2018) Glossaire. Rapport spécial sur les conséquences d’un réchauffement planétaire de 1,5 °C. [En ligne]. Genève, GIEC. [Consulté le 20/02/2026]. <URL : https://www.ipcc.ch/site/assets/uploads/sites/2/2019/10/SR15_Glossary_french.pdf>. @fr
was quoted from: Adapted from GIEC (2018) Glossaire. Rapport spécial sur les conséquences d’un réchauffement planétaire de 1,5 °C. [En ligne]. Genève, GIEC. [Consulté le 20/02/2026]. <URL : https://www.ipcc.ch/site/assets/uploads/sites/2/2019/10/SR15_Glossary_french.pdf>.

preventive silviculture
has status: Published
type: Concept
broader: prevention
definition: Ensemble des interventions à renforcer dans la sylviculture classique, ou à ajouter, dans le but de prévenir les risques. @fr
definition: All interventions to be strengthened within conventional silviculture, or added to it, for the purpose of preventing risks.
in scheme: Thesaurus Multirisque FORESTT
narrower: prevention through genetics
narrower: choice of species
narrower: silvicultural action
preferred label: sylviculture préventive @fr
was quoted from: Adapté de Revertegat et al. (2025) Synthèse sur la vulnérabilité des peuplements forestiers au feu. Rapport final du projet AFORCE VULNEFEU (Vulnefeu04). [En ligne]. Réseau AFORCE, 2025. [Consulté le 25/03/2026]. <URL : https://www.reseau-aforce.fr/sites/reseau-aforce/files/2025-07/Rapport-Vulnefeu04-compressed.pdf @fr
was quoted from: Adapted from Revertegat et al. (2025) Synthèse sur la vulnérabilité des peuplements forestiers au feu. Rapport final du projet AFORCE VULNEFEU (Vulnefeu04). [En ligne]. Réseau AFORCE, 2025. [Consulté le 25/03/2026]. <URL : https://www.reseau-aforce.fr/sites/reseau-aforce/files/2025-07/Rapport-Vulnefeu04-compressed.pdf

hundred-year flood
has status: Published
type: Concept
broader: flood
definition: Crue qui a une chance sur cent de se produire chaque année, c'est-à-dire que ce débit a une chance sur cent d'être atteint chaque année. @fr
definition: A flood that has a one-in-a-hundred chance of occurring each year, i.e. this flow rate has a one-in-a-hundred chance of being reached each year.
in scheme: Thesaurus Multirisque FORESTT
preferred label: crue centennale @fr
was quoted from: Geoconfluences. Glossaire. [En ligne]. Lyon, ENS Lyon. [Consulté le 20/02/2026]. <URL : https://geoconfluences.ens-lyon.fr/glossaire/crue-decennale-centenale>. @fr

sensitivity related to sugar management
has status: Published
type: Concept
broader: sensitivity related to phenology
definition: Mesure dans laquelle une espèce forestière est affectée par un aléa du fait de sa capacité de mobilisation et de stockage des réserves carbonées. @fr
definition: Extent to which a forest species is affected by a hazard due to its capacity to mobilise and store carbon reserves.
in scheme: Thesaurus Multirisque FORESTT
preferred label: sensibilité liée à la gestion des sucres @fr
was quoted from: Groupe de travail « Thésaurus du multirisque en forêt » du projet X-RISKS du PEPR FORESTT (ANR-24-PEFO-0005). [En ligne]. <URL : https://www.pepr-forestt.fr/projets/pc-x-risks> @fr

choice of provenances
has status: Published
type: Concept
broader: choice of species
definition: Sélection de provenances forestières adaptées au climat et aux risques futurs. @fr
definition: Selection of forest provenances adapted to climate and future risks.
in scheme: Thesaurus Multirisque FORESTT
preferred label: choix des provenances @fr
was quoted from: Adapté de Legay (2019) Adapter les forêts du Grand Est au changement climatique : Comment choisir les essences-objectifs. [En ligne]. INRAE. [Consulté le 01/04/2026]. <URL : https://renfor.hub.inrae.fr/content/download/3925/36598?version=1> @fr
was quoted from: Adapted from Legay (2019) Adapter les forêts du Grand Est au changement climatique : Comment choisir les essences-objectifs. [En ligne]. INRAE. [Consulté le 01/04/2026]. <URL : https://renfor.hub.inrae.fr/content/download/3925/36598?version=1>

sensitivity related to soil-climate conditions
has status: Published
type: Concept
broader: vulnerability of the forest
definition: Mesure dans laquelle un écosystème forestier est affecté par un aléa du fait de facteurs de sol et de climat. @fr
definition: Extent to which a forest ecosystem is affected by a hazard due to soil and climate factors.
in scheme: Thesaurus Multirisque FORESTT
narrower: sensitivity related to site conditions
narrower: forest sensitivity related to human actions
narrower: climate-related forest sensitivity
narrower: sensitivity related to forest structure
preferred label: sensibilité liée aux conditions pédo-climatiques @fr
was quoted from: Adapté de INRAE (2023) Arbres, forêts et sécheresse. [En ligne]. [Consulté le 20/02/2026]. <URL : https://www.inrae.fr/actualites/arbres-forets-secheresse>. @fr
was quoted from: Adapted from INRAE (2023) Arbres, forêts et sécheresse. [En ligne]. [Consulté le 20/02/2026]. <URL : https://www.inrae.fr/actualites/arbres-forets-secheresse>.

dependence on supply for processing actors
has status: Published
type: Concept
broader: vulnerability of processing actors
definition: Vulnérabilité des acteurs de la transformation forestière liée à leur trop forte dépendance aux approvisionnement en bois. @fr
definition: Vulnerability of forest processing actors related to their excessive dependence on wood supply.
in scheme: Thesaurus Multirisque FORESTT
preferred label: dépendance aux approvisionnements des acteurs de la transformation @fr
was quoted from: Groupe de travail « Thésaurus du multirisque en forêt » du projet X-RISKS du PEPR FORESTT (ANR-24-PEFO-0005). [En ligne]. <URL : https://www.pepr-forestt.fr/projets/pc-x-risks> @fr

wildland-urban interface
has status: Published
type: Concept
broader: urban planning sector
definition: Zone où les constructions et autres aménagements humains côtoient ou se confondent avec des espaces naturels non aménagés ou des combustibles végétaux, l'exposant à l'aléa feu de forêt. @fr
definition: Zone where buildings and other human developments border or intermingle with unmanaged natural areas or plant fuels, exposing it to forest fire hazard.
in scheme: Thesaurus Multirisque FORESTT
preferred label: interface habitat forêt @fr

incendie
type: Collection
in scheme: Thesaurus Multirisque FORESTT
member: burnt wood
member: tactical firebreak
member: ground intervention
member: aerial intervention
member: forest massif plan for protection against fires (PMPFCI)
member: legal obligation to clear vegetation
member: departmental forest fire protection plan (PDPFCI)
member: regulation of access to forest massifs
member: choice of less fire-vulnerable species
member: fuel break network
member: fuel management
member: pruning
member: fuel break
member: safety fuel-clearance strip
member: self-protection of forest stands
member: prescribed burning
member: controlled grazing
member: foliage scorch
member: trunk charring
member: combustibility
member: fire resilience
member: fire resistance
member: thin bark
member: forest, agricultural land and vegetation fire
member: flame front
member: fire severity
member: fire intensity
member: fire occurrence probability
member: induced hazard
member: experienced hazard
member: fire occurrence
member: spotting
member: crown fire
member: surface fire
member: fire activity
member: burnt area
member: DFCI service
member: forest fire hazard mapping
member: diversification of land use at massif scale
member: low stump-sprouting capacity
member: low or impossible post-fire germination
member: sexual immaturity
member: danger zone
member: fire outbreak surveillance
member: heavy thinning
member: hydric network
member: French forest fire database (BDIFF)
member: forest-weather index (FWI)
member: forest weather forecast
member: risk transfer
member: forest insurance
member: multi-risk forest insurance
member: risk pooling
member: high combustibility
member: stand structure
member: low moisture content
member: high fuel biomass
member: fine, dry leaf
member: presence of flammable compounds
member: forest fire risk prevention plan (PPRIF)
member: zombie fire
member: extreme wildfire
member: dead branch retention
member: vertical fuel continuity
member: horizontal fuel continuity
member: access road network
member: water point network
member: forest signage
member: feedback from experience
member: tactical fire
member: control line
member: fire cause and circumstance investigation (RCCI)

soil erosion
has status: Published
type: Concept
broader: natural hazard
definition: All external phenomena that, at or near the surface, modify relief through the removal of solid material.
definition: Ensemble de phénomènes externes, qui à la surface ou à faible profondeur, modifient le relief par enlèvement de matière solide. @fr
in scheme: Thesaurus Multirisque FORESTT
narrower: wind erosion of soils
narrower: water erosion of soils
preferred label: érosion des sols @fr
was quoted from: Adapted from Geoconfluences. Glossaire - Érosion. [En ligne]. Lyon, ENS Lyon. [Consulté le 20/02/2026]. <URL : https://geoconfluences.ens-lyon.fr/glossaire/erosion>.
was quoted from: Adapté de Geoconfluences. Glossaire - Érosion. [En ligne]. Lyon, ENS Lyon. [Consulté le 20/02/2026]. <URL : https://geoconfluences.ens-lyon.fr/glossaire/erosion>. @fr

forest signage
has status: Published
type: Concept
broader: adapt forest infrastructure
definition: Panneaux et balisages facilitant la circulation des intervenants en forêt et informant les usagers sur les risques. @fr
definition: Signs and markers facilitating the movement of forest personnel and informing users of risks.
in scheme: Thesaurus Multirisque FORESTT
preferred label: signalétique en forêt @fr
was quoted from: Adapted from Rigolot & Costa (coord.) (2000) Conception des coupures de combustible. Réseau Coupures de combustible RCC n°4, 2000. [En ligne]. Éditions de la Cardère. [Consulté le 01/04/2026]. <URL : https://cardere.fr/doc/RCC4.pdf>
was quoted from: Adapté de Rigolot & Costa (coord.) (2000) Conception des coupures de combustible. Réseau Coupures de combustible RCC n°4, 2000. [En ligne]. Éditions de la Cardère. [Consulté le 01/04/2026]. <URL : https://cardere.fr/doc/RCC4.pdf> @fr

land fragmentation
has status: Published
type: Concept
broader: urbanisation
definition: Division excessive des propriétés forestières freinant la bonne gestion des forêts. @fr
definition: Excessive division of forest properties hindering good forest management.
in scheme: Thesaurus Multirisque FORESTT
preferred label: morcellement de la propriété @fr
was quoted from: Adapté de Humbert (2007) Morcellement de la propriété forestière privée. Question écrite n°25233 au Sénat. [En ligne]. JO Sénat, 9 novembre (réponse le 8 mars 2007). Consulté le 27/03/2026], <URL : https://www.senat.fr/questions/base/2006/qSEQ061125233.html> @fr
was quoted from: Adapted from Humbert (2007) Morcellement de la propriété forestière privée. Question écrite n°25233 au Sénat. [En ligne]. JO Sénat, 9 novembre (réponse le 8 mars 2007). Consulté le 27/03/2026], <URL : https://www.senat.fr/questions/base/2006/qSEQ061125233.html>

concurrence of hazards
has status: Published
type: Concept
broader: simultaneous risks
definition: Aléa survenant simultanément ou quasi-simultanément (avant que le système n'ai récupéré du premier choc). @fr
definition: Hazard occurring simultaneously or almost simultaneously (before the system has recovered from the first shock).
in scheme: Thesaurus Multirisque FORESTT
preferred label: concomitance d'aléas @fr
was quoted from: Adapté de Curt (2020) Multirisque : quelles orientations de recherche dans les travaux récents ? [En ligne]. [Consulté le 20/02/2026]. <URL : https://hal.science/hal-03462813/document>. @fr
was quoted from: Adapted from Curt (2020) Multirisque : quelles orientations de recherche dans les travaux récents ? [En ligne]. [Consulté le 20/02/2026]. <URL : https://hal.science/hal-03462813/document>.

inability to manage crisis timber
has status: Published
type: Concept
broader: vulnerability of the wood sector
definition: Incapacité technique, organisationnelle, réglementaire ou économique à traiter les bois de crise. @fr
definition: Technical, organisational, regulatory or economic inability to process crisis timber.
in scheme: Thesaurus Multirisque FORESTT
narrower: volume of crisis timber unmanageable by the wood sector
narrower: unmanageable nature of crisis timber for the wood sector
preferred label: incapacité à gérer les bois de crise @fr
was quoted from: Adapté de Ayphassorho et al. (2025) Valorisation des bois de crise et résilience de la filière forêt-bois : Vers une culture du risque. Rapport CGAAER n° 24073 - IGEDD n° 015817-01. IGEDD / CGAAER, 2025, 166 p. [En ligne]. [Consulté le 25/03/2026]. <URL : https://www.igedd.developpement-durable.gouv.fr/IMG/pdf/015817-01_rapport_publie_cle5431ce.pdf> @fr
was quoted from: Adapted from Ayphassorho et al. (2025) Valorisation des bois de crise et résilience de la filière forêt-bois : Vers une culture du risque. Rapport CGAAER n° 24073 - IGEDD n° 015817-01. IGEDD / CGAAER, 2025, 166 p. [En ligne]. [Consulté le 25/03/2026]. <URL : https://www.igedd.developpement-durable.gouv.fr/IMG/pdf/015817-01_rapport_publie_cle5431ce.pdf>

control measure
has status: Published
type: Concept
broader: curative silvicultural action
definition: Action contre un organisme nuisible affectant une forêt. @fr
definition: Action against a harmful organism affecting a forest.
in scheme: Thesaurus Multirisque FORESTT
narrower: felling of a contaminated tree
preferred label: mesure de lutte @fr
was quoted from: Adapté de AGROVOC. Lutte biologique contre les ravageurs. [En ligne]. FAO. [Consulté le 25/03/2026]. <URL : https://agrovoc.fao.org/browse/agrovoc/fr/page/c_330635> @fr
was quoted from: Adapted from AGROVOC. Lutte biologique contre les ravageurs. [En ligne]. FAO. [Consulté le 25/03/2026]. <URL : https://agrovoc.fao.org/browse/agrovoc/fr/page/c_330635>

fungal phytopathogenic agent
has status: Published
type: Concept
broader: plant pathogen
definition: Organisme fongique susceptible d’induire des maladies chez les plantes ligneuses. @fr
definition: Fungal organism capable of inducing diseases in woody plants.
in scheme: Thesaurus Multirisque FORESTT
narrower: rust fungal disease
narrower: root and collar pathogen
narrower: trunk pathogen
narrower: canker fungal disease
narrower: twig and shoot blight fungus
narrower: foliar fungal disease
narrower: seed and seedling fungal disease
narrower: vascular fungus
preferred label: agent phytopathogène fongique @fr
was quoted from: Adapté de EPHYTIA-INRAE. Champignons et autres pathogènes. [En ligne]. [Consulté le 20/02/2026]. <URL : https://ephytia.inrae.fr/fr/C/18521/Forets-Champignons-et-autres-pathogenes>. @fr
was quoted from: Adapted from EPHYTIA-INRAE. Champignons et autres pathogènes. [En ligne]. [Consulté le 20/02/2026]. <URL : https://ephytia.inrae.fr/fr/C/18521/Forets-Champignons-et-autres-pathogenes>.

departmental forest fire protection plan (PDPFCI)
has status: Published
type: Concept
broader: regulatory measure
definition: Planning document that defines, at the departmental level, the main guidelines for fire prevention and firefighting, as well as the actions to be carried out and the objectives to be achieved.
definition: Document de planification qui définit à l'échelle départementale les grandes orientations en matière de prévention et de lutte contre les incendies, mais également les actions à mener et les objectifs à atteindre. @fr
in scheme: Thesaurus Multirisque FORESTT
preferred label: plan départemental de protection des forêts contre les incendies (pdpfci) @fr
was quoted from: Adapted from Ministère de l’Intérieur. La stratégie de lutte contre les feux de forêt en France. [En ligne]. Publié le 12/04/2023. [Consulté le 25/03/2026]. <URL : https://www.interieur.gouv.fr/actualites/grands-dossiers/strategie-lutte-feux-foret-france>
was quoted from: Adapté de Ministère de l’Intérieur. La stratégie de lutte contre les feux de forêt en France. [En ligne]. Publié le 12/04/2023. [Consulté le 25/03/2026]. <URL : https://www.interieur.gouv.fr/actualites/grands-dossiers/strategie-lutte-feux-foret-france> @fr

date of occurrence of frost
has status: Published
type: Concept
alternative label: season of occurrence of frost
alternative label: saison d'occurrence du gel @fr
broader: hazard characterisation
definition: Dates de début et fin d’un épisode de gel. @fr
definition: Start and end dates of a frost episode.
in scheme: Thesaurus Multirisque FORESTT
preferred label: date d'occurrence du gel @fr
was quoted from: Adapted from EPHYTIA-INRAE. [En ligne]. [Consulté le 20/02/2026]. <URL : https://ephytia.inrae.fr/fr/C/18542/Forets-Froids-gelees>.
was quoted from: Adapté de EPHYTIA-INRAE. [En ligne]. [Consulté le 20/02/2026]. <URL : https://ephytia.inrae.fr/fr/C/18542/Forets-Froids-gelees>. @fr

sentinel nursery
has status: Published
type: Concept
broader: early detection
definition: Pépinière forestière utilisée pour surveiller l'apparition de ravageurs et d'agents pathogènes. @fr
definition: Forest nursery used to monitor the emergence of pests and pathogens.
in scheme: Thesaurus Multirisque FORESTT
preferred label: pépinière sentinelle @fr
was quoted from: Groupe de travail « Thésaurus du multirisque en forêt » du projet X-RISKS du PEPR FORESTT (ANR-24-PEFO-0005). [En ligne]. <URL : https://www.pepr-forestt.fr/projets/pc-x-risks> @fr

legal obligation to clear vegetation
has status: Published
type: Concept
broader: regulatory measure
definition: Obligation under the Forest Code, in territories particularly exposed to fire risk, for owners to remove fuel within a depth of 50 metres around buildings located within, and less than 200 metres from, forest massifs, moorland, scrubland or garrigue classified as fire risk areas.
definition: Obligation faite par le code forestier dans les territoires particulièrement exposés au risque d’incendie au propriétaire de réaliser des suppressions de combustibles sur une profondeur de 50 mètres autour des constructions situées à l’intérieur et à moins de 200 mètres des massifs forestiers, landes, maquis ou garrigues classés à risque d’incendie. @fr
in scheme: Thesaurus Multirisque FORESTT
preferred label: obligation légale de débroussaillement @fr
was quoted from: Adapted from Géorisques. Obligations légales de débroussaillement (OLD). [En ligne]. Ministère de la Transition écologique et de la Cohésion des territoires. [Consulté le 02/04/2026]. <URL : https://www.georisques.gouv.fr/me-preparer-me-proteger/OLD-obligations-legales-de-debroussaillement>
was quoted from: Adapté de Géorisques. Obligations légales de débroussaillement (OLD). [En ligne]. Ministère de la Transition écologique et de la Cohésion des territoires. [Consulté le 02/04/2026]. <URL : https://www.georisques.gouv.fr/me-preparer-me-proteger/OLD-obligations-legales-de-debroussaillement> @fr

outbreak confirmation
has status: Published
type: Concept
broader: outbreak focus
definition: Vérification officielle de la présence d’un organisme nuisible. @fr
definition: Official verification of the presence of a harmful organism.
in scheme: Thesaurus Multirisque FORESTT
preferred label: confirmation de foyer @fr
was quoted from: Adapté de Plan national d'intervention sanitaire d'urgence relatif à Bursaphelenchus xylophilus (nématode du pin). [En ligne]. [Consulté le 20/02/2026]. <URL : https://info.agriculture.gouv.fr/boagri/instruction-2019-209>. @fr
was quoted from: Adapted from Plan national d'intervention sanitaire d'urgence relatif à Bursaphelenchus xylophilus (nématode du pin). [En ligne]. [Consulté le 20/02/2026]. <URL : https://info.agriculture.gouv.fr/boagri/instruction-2019-209>.

power line
has status: Published
type: Concept
broader: energy sector
definition: Infrastructure d'acheminement de l'électricité exposée aux aléas de la forêt lorsqu'elle la traverse. Cette infrastructure peut aussi être une cause d'incendie de forêt. @fr
definition: Electricity transmission infrastructure exposed to forest hazards when it crosses the forest. This infrastructure can also be a cause of forest fire.
in scheme: Thesaurus Multirisque FORESTT
preferred label: ligne électrique @fr
was quoted from: Groupe de travail « Thésaurus du multirisque en forêt » du projet X-RISKS du PEPR FORESTT (ANR-24-PEFO-0005). [En ligne]. <URL : https://www.pepr-forestt.fr/projets/pc-x-risks> @fr

wood blue stain
has status: Published
type: Concept
broader: loss of wood quality
definition: Coloration bleue du bois en raison d'une infection par un micro-organisme. @fr
definition: Blue discolouration of wood due to infection by a micro-organism.
in scheme: Thesaurus Multirisque FORESTT
preferred label: bleuissement du bois @fr
was quoted from: Groupe de travail « Thésaurus du multirisque en forêt » du projet X-RISKS du PEPR FORESTT (ANR-24-PEFO-0005). [En ligne]. <URL : https://www.pepr-forestt.fr/projets/pc-x-risks> @fr

catastrophic event
has status: Published
type: Concept
alternative label: catastrophe @fr
alternative label: disaster
broader: qualitative risk assessment
definition: Manifestation of an extreme hazard at a given location over a given period of time, which has resulted in a disaster due to its conjunction with other risk factors such as exposure and vulnerability.
definition: Manifestation d’un aléa extrême en un lieu donné pendant une période de temps donnée, ayant entraîné une catastrophe en raison de la conjonction avec d'autres facteurs de risque comme l'exposition et la vulnérabilité. @fr
in scheme: Thesaurus Multirisque FORESTT
preferred label: évènement catastrophique @fr
was quoted from: Adapted from United Nations Office for Disaster Risk Reduction (UNDRR). 2017. The Sendai Framework Terminology on Disaster Risk Reduction. "Hazardous event". Accessed 3 April 2026. https://www.undrr.org/terminology/hazardous-event.
was quoted from: Adapté de United Nations Office for Disaster Risk Reduction (UNDRR). 2017. The Sendai Framework Terminology on Disaster Risk Reduction. "Hazardous event". Accessed 3 April 2026. https://www.undrr.org/terminology/hazardous-event. @fr

response to protect the wood sector
has status: Published
type: Concept
broader: risk to the wood sector
definition: Action visant soit à supprimer le risque pour la filière forêt-bois en éliminant la cause, soit à le réduire en diminuant sa probabilité d’occurrence ou son impact sur la filière forêt-bois en agissant sur l'aléa, la vulnérabilité ou l'exposition des enjeux de la filière, soit à le transférer vers un tiers. @fr
definition: Action aimed either at eliminating the risk to the forest-wood sector by removing its cause, or at reducing it by decreasing its probability of occurrence or its impact on the sector by acting on the hazard, vulnerability or exposure of sector assets, or at transferring it to a third party.
in scheme: Thesaurus Multirisque FORESTT
narrower: response to protect the company
narrower: reconstitution plan
narrower: structural assistance
narrower: response to protect the owner
narrower: risk prevention plan
narrower: crisis management plan
preferred label: réponse pour protéger la filière bois @fr
was quoted from: Adapté de FAO. Agrovoc : gestion du risque. [En ligne]. FAO. [Consulté le 07/04/2026]. <URL : https://agrovoc.fao.org/browse/agrovoc/fr/page/c_37934> @fr
was quoted from: Adapted from FAO. Agrovoc : gestion du risque. [En ligne]. FAO. [Consulté le 07/04/2026]. <URL : https://agrovoc.fao.org/browse/agrovoc/fr/page/c_37934>

regional recommendation sheet
has status: Published
type: Concept
broader: national FRM regulation
definition: "Usage advice" sheets included in regional orders defining the lists of forest reproductive material eligible for state aid (species, provenance regions, phenotypic and genetic selections, seed and plant quality standards), according to areas of use.
definition: Fiches "Conseils d'utilisation" reprises dans des arrêtés régionaux définissant les listes de matériels forestiers de reproduction éligibles aux aides de l’État (espèces, régions de provenance, sélections phénotypiques et génétiques, normes de qualité des semences et plants), en fonction des zones d'utilisation. @fr
in scheme: Thesaurus Multirisque FORESTT
preferred label: fiche de recommandations régionales @fr
was quoted from: Ministère de l’Agriculture. [En ligne]. Paris, Ministère de l’Agriculture. [Consulté le 20/02/2026]. <URL : https://agriculture.gouv.fr/materiels-forestiers-de-reproduction-arretes-regionaux-relatifs-aux-aides-de-letat-linvestissement>.

zombie fire
has status: Published
type: Concept
broader: forest, agricultural land and vegetation fire
definition: Incendie qui se réactive au printemps après avoir couvé dans le sol pendant l'hiver. @fr
definition: Fire that reactivates in spring after smouldering in the ground throughout winter.
in scheme: Thesaurus Multirisque FORESTT
preferred label: feu zombie @fr
was quoted from: Adapté de Estève (2020) "Incendies zombies" en Arctique : un phénomène surmédiatisé qui alerte sur le réchauffement climatique. [En ligne]. CNES GeoImage. [Consulté le 07/04/2026]. <URL : https://cnes.fr/geoimage/incendies-zombies-arctique-un-phenomene-surmediatise-alerte-rechauffement-climatique> @fr
was quoted from: Adapted from Estève (2020) "Incendies zombies" en Arctique : un phénomène surmédiatisé qui alerte sur le réchauffement climatique. [En ligne]. CNES GeoImage. [Consulté le 07/04/2026]. <URL : https://cnes.fr/geoimage/incendies-zombies-arctique-un-phenomene-surmediatise-alerte-rechauffement-climatique>

plant bioagressor
has status: Published
type: Concept
broader: biotic hazard
definition: Organisme vivant qui cause des dommages aux végétaux @fr
definition: Living organism that causes damage to plants.
in scheme: Thesaurus Multirisque FORESTT
narrower: plant pathogen
narrower: pest insect
narrower: rodent
narrower: wild ungulate
preferred label: bioagresseur des végétaux @fr
was quoted from: Adapté de FranceTerme. Bioagresseur des végétaux. [En ligne]. Paris, Ministère de la Culture. [Consulté le 20/02/2026]. <URL : https://www.culture.fr/franceterme/terme/agri1320>. @fr
was quoted from: Adapted from FranceTerme. Bioagresseur des végétaux. [En ligne]. Paris, Ministère de la Culture. [Consulté le 20/02/2026]. <URL : https://www.culture.fr/franceterme/terme/agri1320>.

invasive alien species
has status: Published
type: Concept
broader: hazard characterisation
definition: Species introduced by humans, deliberately or unintentionally, into a territory outside its natural range, and which threatens ecosystems, natural habitats or local species.
definition: Espèce introduite par l’homme volontairement ou involontairement sur un territoire hors de son aire de répartition naturelle, et qui menace les écosystèmes, les habitats naturels ou les espèces locales. @fr
in scheme: Thesaurus Multirisque FORESTT
preferred label: invasif exotique @fr
was quoted from: MEEM. Espèces exotiques envahissantes. [En ligne]. Paris, Ministère de l’Environnement. [Consulté le 20/02/2026]. <URL : https://www.ecologie.gouv.fr/politiques-publiques/especes-exotiques-envahissantes>.

canker fungal disease
has status: Published
type: Concept
broader: fungal phytopathogenic agent
definition: Lésion localisée du cambium et de l’écorce provoquée par un champignon. @fr
definition: Localised lesion of the cambium and bark caused by a fungus.
in scheme: Thesaurus Multirisque FORESTT
preferred label: maladie fongique à chancre @fr
was quoted from: Adapté de EPHYTIA-INRAE. Carpophore - cycle végétatif. [En ligne]. [Consulté le 20/02/2026]. <URL : https://ephytia.inra.fr/fr/C/16214/Hypp-encyclopedie-en-protection-des-plantes-carpophore-cycle-vegetatif>. @fr
was quoted from: Adapted from EPHYTIA-INRAE. Carpophore - cycle végétatif. [En ligne]. [Consulté le 20/02/2026]. <URL : https://ephytia.inra.fr/fr/C/16214/Hypp-encyclopedie-en-protection-des-plantes-carpophore-cycle-vegetatif>.

multi-hazard
has status: Published
type: Concept
broader: multi-hazard/vulnerability
definition: All the relevant risks in a given area.
definition: Ensemble des risques pertinents dans une zone donnée. @fr
in scheme: Thesaurus Multirisque FORESTT
narrower: multi-hazard impact
preferred label: multi-aléa @fr
was quoted from: Adapted from Gallina et al. (2016) A review of multi-risk methodologies for natural hazards: Consequences and challenges for a climate change impact assessment. Journal of Environmental Management, 2016, vol. 168, pp. 123-132. [En ligne]. ScienceDirect. [Consulté le 07/04/2026]. <URL : https://doi.org/10.1016/j.jenvman.2015.11.011>
was quoted from: Adapté de Gallina et al. (2016) A review of multi-risk methodologies for natural hazards: Consequences and challenges for a climate change impact assessment. Journal of Environmental Management, 2016, vol. 168, pp. 123-132. [En ligne]. ScienceDirect. [Consulté le 07/04/2026]. <URL : https://doi.org/10.1016/j.jenvman.2015.11.011> @fr

suspected outbreak
has status: Published
type: Concept
broader: outbreak focus
definition: Présence de symptômes laissant supposer un foyer d'organisme nuisible. @fr
definition: Presence of symptoms suggesting an outbreak of a harmful organism.
in scheme: Thesaurus Multirisque FORESTT
preferred label: suspicion de foyer @fr
was quoted from: Adapté de Plan national d'intervention sanitaire d'urgence relatif à Bursaphelenchus xylophilus (nématode du pin), [En ligne]. [Consulté le 20/02/2026]. <URL : https://info.agriculture.gouv.fr/boagri/instruction-2019-209>. @fr
was quoted from: Adapted from Plan national d'intervention sanitaire d'urgence relatif à Bursaphelenchus xylophilus (nématode du pin), [En ligne]. [Consulté le 20/02/2026]. <URL : https://info.agriculture.gouv.fr/boagri/instruction-2019-209>.

natural regeneration deficit
has status: Published
type: Concept
broader: demographic factor
definition: Lack of capacity of a forest to cope with hazards due to a lack of natural stand renewal.
definition: Manque de capacité d'une forêt à faire face aux aléas du fait d'un manque de renouvellement naturel des peuplements. @fr
in scheme: Thesaurus Multirisque FORESTT
narrower: low stump-sprouting capacity
narrower: low or impossible post-fire germination
preferred label: déficit de régénération naturelle @fr
was quoted from: Groupe de travail « Thésaurus du multirisque en forêt » du projet X-RISKS du PEPR FORESTT (ANR-24-PEFO-0005). [En ligne]. <URL : https://www.pepr-forestt.fr/projets/pc-x-risks> @fr

downstream building
has status: Published
type: Concept
broader: urban planning sector
definition: Construction située en aval d’un aléa gravitaire. @fr
definition: Structure located downstream of a gravitational hazard.
in scheme: Thesaurus Multirisque FORESTT
preferred label: batiment à l'aval @fr
was quoted from: Adapté de Observaterre. Que sont les risques gravitaires ? [En ligne]. Observatoire des risques telluriques en France – Risque mouvement de terrain. [Consulté le 25/03/2026]. <URL : https://observaterre.fr/risques-telluriques-en-france/risque-mouvement-de-terrain/que-sont-les-risques-gravitaires/> @fr
was quoted from: Adapted from Observaterre. Que sont les risques gravitaires ? [En ligne]. Observatoire des risques telluriques en France – Risque mouvement de terrain. [Consulté le 25/03/2026]. <URL : https://observaterre.fr/risques-telluriques-en-france/risque-mouvement-de-terrain/que-sont-les-risques-gravitaires/>

multiple vulnerabilities
has status: Published
type: Concept
broader: multiple risks
definition: Ensemble des vulnérabilités des enjeux exposés du système d'intérêt. @fr
definition: All the vulnerabilities of the exposed assets of the system of interest.
in scheme: Thesaurus Multirisque FORESTT
preferred label: vulnérabilités multiples @fr
was quoted from: Groupe de travail « Thésaurus du multirisque en forêt » du projet X-RISKS du PEPR FORESTT (ANR-24-PEFO-0005). [En ligne]. <URL : https://www.pepr-forestt.fr/projets/pc-x-risks> @fr

buck rubbing
has status: Published
type: Concept
broader: mechanical destruction
definition: Acte lié au comportement des cervidés qui frottent leurs bois sur de jeunes arbres pour marquer leur territoire ou en période de frayure (chute du velours de leurs bois) et de rute. @fr
definition: Behaviour of deer rubbing their antlers on young trees to mark their territory or during the period of velvet shedding and the rut.
in scheme: Thesaurus Multirisque FORESTT
preferred label: frottis @fr
was quoted from: Communes forestières AURA. [En ligne]. [Consulté le 20/02/2026]. <URL : https://www.communesforestieres-aura.org/documents/ressources/63/2021-cofor63_guide_lexique.pdf>. @fr

capillary rise
has status: Published
type: Concept
broader: sensitivity related to water conditions
definition: Slow rise of soil water towards the surface, linked to soil porosity or root suction.
definition: Montée lente de l’eau du sol vers la surface liée à la porosité du sol ou à la succion des racines. @fr
in scheme: Thesaurus Multirisque FORESTT
preferred label: remontée capillaire @fr
was quoted from: Adapté de Plantes-et-eau.fr. [En ligne]. [Consulté le 20/02/2026]. <URL : https://www.plantes-et-eau.fr/documentation/outils-et-concepts-de-base/17-le-sol-reservoir-d-eau-pour-les-plantes/119-les-relations-potentiel-hydrique-humidite-dans-un-sol>. @fr
was quoted from: Adapted from Plantes-et-eau.fr. [En ligne]. [Consulté le 20/02/2026]. <URL : https://www.plantes-et-eau.fr/documentation/outils-et-concepts-de-base/17-le-sol-reservoir-d-eau-pour-les-plantes/119-les-relations-potentiel-hydrique-humidite-dans-un-sol>.

crisis timber storage
has status: Published
type: Concept
broader: crisis timber management
definition: Good practices for the storage of crisis timber to maintain wood quality and avoid bark beetle outbreaks.
definition: Bonnes pratiques dans le stockage des bois de crise pour le maintien de la qualité du bois et l'évitement de la pullulation de scolytes. @fr
in scheme: Thesaurus Multirisque FORESTT
preferred label: stockage de bois de crise @fr
was quoted from: Adapté de Ayphassorho et al. (2025) Valorisation des bois de crise et résilience de la filière forêt-bois : Vers une culture du risque. Rapport CGAAER n° 24073 - IGEDD n° 015817-01. IGEDD / CGAAER, 2025, 166 p. [En ligne]. [Consulté le 25/03/2026]. <URL : https://www.igedd.developpement-durable.gouv.fr/IMG/pdf/015817-01_rapport_publie_cle5431ce.pdf> @fr
was quoted from: Adapted from Ayphassorho et al. (2025) Valorisation des bois de crise et résilience de la filière forêt-bois : Vers une culture du risque. Rapport CGAAER n° 24073 - IGEDD n° 015817-01. IGEDD / CGAAER, 2025, 166 p. [En ligne]. [Consulté le 25/03/2026]. <URL : https://www.igedd.developpement-durable.gouv.fr/IMG/pdf/015817-01_rapport_publie_cle5431ce.pdf>

transport sector
has status: Published
type: Concept
broader: non-forest asset at risk
definition: Sector encompassing all activities related to the movement of people, goods or animals, via different modes (road, rail, air, water).
definition: Secteur qui englobe l'ensemble des activités de déplacement de personnes, marchandises ou animaux, via différents modes (route, rail, air, eau). @fr
in scheme: Thesaurus Multirisque FORESTT
narrower: access route
preferred label: secteur des transports @fr
was quoted from: FAO Agrovoc. [En ligne]. Rome, FAO. [Consulté le 20/02/2026]. <URL : http://aims.fao.org/aos/agrovoc/c_31891>.

gravitaire
type: Collection
in scheme: Thesaurus Multirisque FORESTT
member: species-specific sensitivity
member: incentive for silviculture in protection forests
member: reforestation
member: protective silviculture
member: maintenance of wooded land status
member: resilient species
member: gravitational hazard
member: torrential hazard
member: ground movement
member: avalanche
member: glacial hazard
member: snow
member: sediment aggradation
member: mudflow
member: flash flood
member: debris flow
member: scouring
member: rapid ground movement
member: slow ground movement
member: dense avalanche
member: mixed avalanche
member: powder avalanche
member: avalanche intensity
member: snow depth
member: wet snow
member: ONF mountain land restoration service (RTM)
member: protection forest
member: protection forest mapping
member: mass rock collapse
member: rockfall
member: rock slide
member: natural regeneration deficit
member: demographic factor
member: reproduction deficit
member: landslide
member: low wound-healing capacity
member: individual factor
member: low tree elasticity
member: strong competition from accompanying vegetation
member: clear-cutting
member: extreme snowfall
member: ground movement risk prevention plan (PPRMT)

multi-risk forest insurance
has status: Published
type: Concept
broader: forest insurance
definition: Insurance jointly covering storm, fire and other risks likely to result in the loss of several decades of growth or a sudden drop in asset value.
definition: Assurance couvrant conjointement les risques tempêtes, incendies et autres sinistres susceptibles d'entrainer la perte de plusieurs décennies de croissance ou la chute brutale de la valeur du patrimoine. @fr
in scheme: Thesaurus Multirisque FORESTT
preferred label: assurance forestière multirisque @fr
was quoted from: Adapted from Courtage-Assurance.org. Parcelle de bois : faut-il l’assurer ? [En ligne]. Courtage-Assurance.org. [Consulté le 25/03/2026]. <URL : https://www.courtage-assurance.org/parcelle-de-bois-faut-il-l-assurer/>
was quoted from: Adapté de Courtage-Assurance.org. Parcelle de bois : faut-il l’assurer ? [En ligne]. Courtage-Assurance.org. [Consulté le 25/03/2026]. <URL : https://www.courtage-assurance.org/parcelle-de-bois-faut-il-l-assurer/> @fr

assisted migration
has status: Published
type: Concept
broader: choice of species
definition: Stratégie d'adaptation des forêts au changement climatique consistant à accompagner la migration d’espèces ou de provenances d’arbres au-delà de leur aire de distribution actuelle en un lieu, souvent plus septentrional ou d’altitude plus élevée, où les résultats des projections climatiques à l’échéance de plusieurs décennies anticipent les conditions de leur niche actuelle. @fr
definition: Forest climate change adaptation strategy consisting of supporting the migration of tree species or provenances beyond their current distribution range to a location, often further north or at higher altitude, where multi-decade climate projections anticipate the conditions of their current niche.
in scheme: Thesaurus Multirisque FORESTT
preferred label: migration assistée @fr
was quoted from: Adapté de INRAE. Adaptation, les pistes d’action. INRAE, dossier « Quelles gestions des forêts pour demain ? », 21 juin 2022. [En ligne]. [Consulté le 25/03/2026]. <URL : https://www.inrae.fr/dossiers/quelles-gestions-forets-demain/adaptation-pistes-daction> @fr
was quoted from: Adapted from INRAE. Adaptation, les pistes d’action. INRAE, dossier « Quelles gestions des forêts pour demain ? », 21 juin 2022. [En ligne]. [Consulté le 25/03/2026]. <URL : https://www.inrae.fr/dossiers/quelles-gestions-forets-demain/adaptation-pistes-daction>

volume of crisis timber unmanageable by the wood sector
has status: Published
type: Concept
broader: inability to manage crisis timber
definition: Exceptional volume of crisis timber exceeding a normal year's harvest, which cannot be absorbed by the forest-wood sector.
definition: Volume exceptionnel de bois de crise dépassant une année de récolte normale, ne pouvant être absorbé par la filière forêt-bois. @fr
in scheme: Thesaurus Multirisque FORESTT
preferred label: volume de bois de crise ingérable par la filière bois @fr
was quoted from: Adapté de Ayphassorho et al. (2025) Valorisation des bois de crise et résilience de la filière forêt-bois : Vers une culture du risque. Rapport CGAAER n° 24073 - IGEDD n° 015817-01. IGEDD / CGAAER, 2025, 166 p. [En ligne]. [Consulté le 25/03/2026]. <URL : https://www.igedd.developpement-durable.gouv.fr/IMG/pdf/015817-01_rapport_publie_cle5431ce.pdf> @fr
was quoted from: Adapted from Ayphassorho et al. (2025) Valorisation des bois de crise et résilience de la filière forêt-bois : Vers une culture du risque. Rapport CGAAER n° 24073 - IGEDD n° 015817-01. IGEDD / CGAAER, 2025, 166 p. [En ligne]. [Consulté le 25/03/2026]. <URL : https://www.igedd.developpement-durable.gouv.fr/IMG/pdf/015817-01_rapport_publie_cle5431ce.pdf>

wood susceptible to pine wood nematode
has status: Published
type: Concept
broader: sensitive host
definition: Bois pouvant héberger ou transmettre le nématode du pin. @fr
definition: Wood capable of harbouring or transmitting the pine wood nematode.
in scheme: Thesaurus Multirisque FORESTT
preferred label: bois sensible au nématode du pin @fr
was quoted from: Adapté de Plan national d'intervention sanitaire d'urgence relatif à Bursaphelenchus xylophilus (nématode du pin). [En ligne]. [Consulté le 20/02/2026]. <URL : https://info.agriculture.gouv.fr/boagri/instruction-2019-209>. @fr
was quoted from: Adapted from Plan national d'intervention sanitaire d'urgence relatif à Bursaphelenchus xylophilus (nématode du pin). [En ligne]. [Consulté le 20/02/2026]. <URL : https://info.agriculture.gouv.fr/boagri/instruction-2019-209>.

instability of processed product prices
has status: Published
type: Concept
broader: market instability
definition: Variation in the prices of sawn timber, panels, etc.
definition: Variation des prix des sciages, panneaux, etc. @fr
in scheme: Thesaurus Multirisque FORESTT
preferred label: instabilité du prix des produits transformés @fr
was quoted from: Adapted from UNECE. Rapport UNECE 2025 France - Marché du bois 2024. 2025. [En ligne]. UNECE. [Consulté le 07/04/2026]. <URL : https://unece.org/sites/default/files/2026-01/Rapport%20UNECE%202025%20France%20-%20March%C3%A9%20du%20bois%202024%20-VF.pdf>
was quoted from: Adapté de UNECE. Rapport UNECE 2025 France - Marché du bois 2024. 2025. [En ligne]. UNECE. [Consulté le 07/04/2026]. <URL : https://unece.org/sites/default/files/2026-01/Rapport%20UNECE%202025%20France%20-%20March%C3%A9%20du%20bois%202024%20-VF.pdf> @fr

sensitivity to large-scale human actions
has status: Published
type: Concept
broader: forest sensitivity related to human actions
definition: Mesure dans laquelle un écosystème forestier est affecté par un aléa du fait d'actions d'aménagement du territoire et d'urbanisation. @fr
definition: Extent to which a forest ecosystem is affected by a hazard due to land-use planning and urbanisation actions.
in scheme: Thesaurus Multirisque FORESTT
narrower: urbanisation
preferred label: sensibilité aux actions de l'homme à grande échelle @fr
was quoted from: Adapté de RNCan - Service canadien des forêts. Glossaire forestier : Sylviculture intensive. [En ligne]. 2019. [Consulté le 25/03/2026]. <URL : https://scf.rncan.gc.ca/termes/vue/1439> @fr
was quoted from: Adapted from RNCan - Service canadien des forêts. Glossaire forestier : Sylviculture intensive. [En ligne]. 2019. [Consulté le 25/03/2026]. <URL : https://scf.rncan.gc.ca/termes/vue/1439>

forest ecosystem service
has status: Published
type: Concept
broader: environmental asset at risk
definition: Avantages que les populations tirent des écosystèmes forestiers. Ils comprennent les services d'approvisionnement, tels que la production de bois ; les services de régulation, tels que la régulation de la qualité des eaux ; les services de soutien, tels que la formation des sols ; ainsi que les services culturels, tels que les avantages récréatifs. @fr
definition: Benefits that people derive from forest ecosystems. These include provisioning services, such as timber production; regulating services, such as water quality regulation; supporting services, such as soil formation; and cultural services, such as recreational benefits.
in scheme: Thesaurus Multirisque FORESTT
preferred label: service écosystémique lié à la forêt @fr
was quoted from: Adapté de Millennium Ecosystem Assessment (2005) Ecosystems and Human Well-being. En ligne]. Millennium Ecosystem Assessment. [Consulté le 01/04/2026]. <URL : https://www.millenniumassessment.org/documents/document.765.aspx.pdf> @fr
was quoted from: Adapted from Millennium Ecosystem Assessment (2005) Ecosystems and Human Well-being. En ligne]. Millennium Ecosystem Assessment. [Consulté le 01/04/2026]. <URL : https://www.millenniumassessment.org/documents/document.765.aspx.pdf>

loss of ecosystem service
has status: Published
type: Concept
broader: economic loss for the forest owner
definition: Diminution des services écosystémiques rendus par les forêts d'un propriétaire. @fr
definition: Decrease in the ecosystem services provided by an owner's forests.
in scheme: Thesaurus Multirisque FORESTT
narrower: loss of recreational services
narrower: loss of non-wood products
preferred label: perte de service écosystémique @fr
was quoted from: Groupe de travail « Thésaurus du multirisque en forêt » du projet X-RISKS du PEPR FORESTT (ANR-24-PEFO-0005). [En ligne]. <URL : https://www.pepr-forestt.fr/projets/pc-x-risks> @fr

drop in timber prices
has status: Published
type: Concept
broader: standing timber price instability
definition: Baisse soudaine du prix du bois. @fr
definition: Sudden fall in the price of timber.
in scheme: Thesaurus Multirisque FORESTT
preferred label: chute des prix du bois @fr
was quoted from: Adapté de Forestopic. Le marché des forêts s'assagit. [En ligne]. Forestopic. [Consulté le 07/04/2026]. <URL : https://www.forestopic.com/fr/foret/economie/2023-marche-forets-assagit?highlight=WyJiYWlzc2UiLCJiYWlzc2VzIiwiYmFpc3NlciIsImJhaXNzZXJhIiwiYmFpc3NcdTAwZTkiXQ==> @fr
was quoted from: Adapted from Forestopic. Le marché des forêts s'assagit. [En ligne]. Forestopic. [Consulté le 07/04/2026]. <URL : https://www.forestopic.com/fr/foret/economie/2023-marche-forets-assagit?highlight=WyJiYWlzc2UiLCJiYWlzc2VzIiwiYmFpc3NlciIsImJhaXNzZXJhIiwiYmFpc3NcdTAwZTkiXQ==>

modernisation plan for processing industries
has status: Published
type: Concept
broader: structural assistance
definition: National action plan for the future of wood processing industries aimed at supporting the modernisation of the forest-wood sector through financial aid for equipment acquisition and structuring investments.
definition: Plan national d'action pour l'avenir des industries de transformation du bois visant au soutien à la modernisation de la filière forêt-bois via des aides financières pour l'acquisition de matériels et des investissements structurants. @fr
in scheme: Thesaurus Multirisque FORESTT
preferred label: plan de modernisation des industries de transformation @fr
was quoted from: Adapted from Ministère de l’Agriculture et de l’Agroalimentaire. Plan National Bois. [En ligne]. Ministère de l’Agriculture et de l’Agroalimentaire. [Consulté le 07/04/2026]. <URL : https://agriculture.gouv.fr/sites/default/files/documents/pdf/plan-bois-HD_cle0411e8.pdf>
was quoted from: Adapté de Ministère de l’Agriculture et de l’Agroalimentaire. Plan National Bois. [En ligne]. Ministère de l’Agriculture et de l’Agroalimentaire. [Consulté le 07/04/2026]. <URL : https://agriculture.gouv.fr/sites/default/files/documents/pdf/plan-bois-HD_cle0411e8.pdf> @fr

demographic factor
has status: Published
type: Concept
broader: lack of adaptive capacity
definition: Manque de capacité d'une forêt à faire face aux aléas du fait de sa démographie. @fr
definition: Lack of capacity of a forest to cope with hazards due to its demographic structure.
in scheme: Thesaurus Multirisque FORESTT
narrower: natural regeneration deficit
narrower: reproduction deficit
preferred label: facteur démographique @fr
was quoted from: Groupe de travail « Thésaurus du multirisque en forêt » du projet X-RISKS du PEPR FORESTT (ANR-24-PEFO-0005). [En ligne]. <URL : https://www.pepr-forestt.fr/projets/pc-x-risks> @fr

pruning
has status: Published
type: Concept
broader: silvicultural action
definition: Coupe, à proximité ou au ras du tronc, des branches latérales, vivantes ou mortes pour améliorer la qualité du bois, mais aussi pour limiter la probabilité de passage du feu en cime. @fr
definition: Cutting, close to or flush with the trunk, of lateral branches, living or dead, to improve wood quality, but also to limit the probability of fire spreading into the crown.
in scheme: Thesaurus Multirisque FORESTT
preferred label: élagage @fr
was quoted from: Adapté de RNCan - Service canadien des forêts. Glossaire forestier : Sylviculture intensive. [En ligne]. 2019. [Consulté le 25/03/2026]. <URL : https://scf.rncan.gc.ca/termes/vue/937> @fr
was quoted from: Adapted from RNCan - Service canadien des forêts. Glossaire forestier : Sylviculture intensive. [En ligne]. 2019. [Consulté le 25/03/2026]. <URL : https://scf.rncan.gc.ca/termes/vue/937>

mechanisation of forestry work
has status: Published
type: Concept
broader: intensive silviculture
definition: Opérations de bûcheronnage réalisées avec des machines. @fr
definition: Logging operations carried out using machines.
in scheme: Thesaurus Multirisque FORESTT
preferred label: mécanisation des travaux forestiers @fr
was quoted from: Adapté de FCBA (2021) Perspectives méca exp forestière. [En ligne]. [Consulté le 20/02/2026]. <URL : https://www.fcba.fr/wp-content/uploads/2021/03/perspectives-meca-exp-forestiere.pdf>. @fr
was quoted from: Adapted from FCBA (2021) Perspectives méca exp forestière. [En ligne]. [Consulté le 20/02/2026]. <URL : https://www.fcba.fr/wp-content/uploads/2021/03/perspectives-meca-exp-forestiere.pdf>.

windthrow
has status: Published
type: Concept
broader: storm-damaged timber
definition: Tree, or group of trees, blown down, uprooted or broken by wind, or broken under the weight of snow, ice, or age.
definition: Arbre, ou groupe d'arbres, renversé, déraciné ou rompu par le vent ou brisé sous le poids de la neige, de la glace, ou de l'âge. @fr
in scheme: Thesaurus Multirisque FORESTT
preferred label: chablis @fr
was quoted from: Adapted from Birot, Landmann et Bonhême (Coord.) (2009). La forêt face aux tempêtes. Éditions Quae, Versailles, coll. Synthèses, 433 p. (p. 18).
was quoted from: Adapté de Birot, Landmann et Bonhême (Coord.) (2009). La forêt face aux tempêtes. Éditions Quae, Versailles, coll. Synthèses, 433 p. (p. 18). @fr

vertical fuel continuity
has status: Published
type: Concept
broader: stand structure
definition: Characterises the vertical distribution of fine fuel particles in a forest stand.
definition: Caractérise la distribution verticale des particules combustibles fin dans un peuplement forestier. @fr
in scheme: Thesaurus Multirisque FORESTT
preferred label: continuité verticale du combustible @fr
was quoted from: Adapté de Revertegat et al. (2025) Synthèse sur la vulnérabilité des peuplements forestiers au feu. Rapport final du projet AFORCE VULNEFEU (Vulnefeu04). [En ligne]. Réseau AFORCE, 2025. [Consulté le 25/03/2026]. <URL : https://www.reseau-aforce.fr/sites/reseau-aforce/files/2025-07/Rapport-Vulnefeu04-compressed.pdf @fr
was quoted from: Adapted from Revertegat et al. (2025) Synthèse sur la vulnérabilité des peuplements forestiers au feu. Rapport final du projet AFORCE VULNEFEU (Vulnefeu04). [En ligne]. Réseau AFORCE, 2025. [Consulté le 25/03/2026]. <URL : https://www.reseau-aforce.fr/sites/reseau-aforce/files/2025-07/Rapport-Vulnefeu04-compressed.pdf

public policy
has status: Published
type: Concept
broader: response to protect the forest
definition: A set of guidelines and principles of action adopted by public authorities, in line with the national socio-economic and environmental policies of a given country, in order to guide risk management decisions.
definition: Ensemble d'orientations et de principes d'action adoptés par les autorités publiques en accord avec les politiques socio-économiques et environnementales nationales d'un pays donné, en vue d'orienter les décisions de gestion des risques. @fr
in scheme: Thesaurus Multirisque FORESTT
narrower: adaptive policy
narrower: forest policy
preferred label: politique publique @fr
was quoted from: Adapted from AGROVOC - FAO. Politique publique (Public policies). [En ligne]. Food and Agriculture Organization of the United Nations. [Consulté le 25/03/2026]. <URL : https://agrovoc.fao.org/browse/agrovoc/fr/page/c_c76a4cba>
was quoted from: Adapté de AGROVOC - FAO. Politique publique (Public policies). [En ligne]. Food and Agriculture Organization of the United Nations. [Consulté le 25/03/2026]. <URL : https://agrovoc.fao.org/browse/agrovoc/fr/page/c_c76a4cba> @fr

aged stand
has status: Published
type: Concept
broader: stand age
definition: Peuplement d'arbres ayant atteint leur dernier stade de développement. @fr
definition: Stand of trees that have reached their final development stage.
in scheme: Thesaurus Multirisque FORESTT
preferred label: peuplement âgé @fr
was quoted from: Adapté de Drénou & Caraglio (2015) ARCHI : une méthode de diagnostic architectural des arbres. Forêt-entreprise, 2015, n°221, pp. 26-31. [En ligne]. HAL INRAE. [Consulté le 01/04/2026]. <URL : https://hal.inrae.fr/hal-02793887v1> @fr
was quoted from: Adapted from Drénou & Caraglio (2015) ARCHI : une méthode de diagnostic architectural des arbres. Forêt-entreprise, 2015, n°221, pp. 26-31. [En ligne]. HAL INRAE. [Consulté le 01/04/2026]. <URL : https://hal.inrae.fr/hal-02793887v1>

climate-related forest sensitivity
has status: Published
type: Concept
broader: sensitivity related to soil-climate conditions
definition: Mesure dans laquelle un écosystème forestier est affecté par un aléa du fait du climat. @fr
definition: Extent to which a forest ecosystem is affected by a hazard due to climate.
in scheme: Thesaurus Multirisque FORESTT
narrower: sensitivity related to phenology
preferred label: sensibilité de la forêt liée au climat @fr
was quoted from: Adapté de GIEC (2018) Glossaire. [En ligne]. Genève, GIEC. [Consulté le 20/02/2026]. <URL : https://www.ipcc.ch/site/assets/uploads/sites/2/2019/10/SR15_Glossary_french.pdf @fr
was quoted from: Adapted from GIEC (2018) Glossaire. [En ligne]. Genève, GIEC. [Consulté le 20/02/2026]. <URL : https://www.ipcc.ch/site/assets/uploads/sites/2/2019/10/SR15_Glossary_french.pdf

genotype mixing favoured by silviculture
has status: Published
type: Concept
broader: genotype mixing
definition: Techniques sylvicoles et modes de traitement favorisant la diversité génétique d'un peuplement forestier afin d'augmenter sa résistance face aux risques biotiques et abiotiques. @fr
definition: Silvicultural techniques and treatment methods favouring the genetic diversity of a forest stand in order to increase its resistance to biotic and abiotic risks.
in scheme: Thesaurus Multirisque FORESTT
preferred label: mélange de génotypes favorisé par la sylviculture @fr
was quoted from: Adapté de Valadon (2009) Effets des interventions sylvicoles sur la diversité génétique des arbres forestiers. Dossiers forestiers de l'ONF n°21, 2009. [En ligne]. Office national des forêts. [Consulté le 02/04/2026]. https://www.onf.fr/outils/ressources/18981c5e-e783-437a-ae82-9a8c88c9e464/++versions++/1/++paras++/2/++ass++/1/++i18n++data:fr?_=1575036432.071749&download=1 @fr
was quoted from: Adapted from Valadon (2009) Effets des interventions sylvicoles sur la diversité génétique des arbres forestiers. Dossiers forestiers de l'ONF n°21, 2009. [En ligne]. Office national des forêts. [Consulté le 02/04/2026]. https://www.onf.fr/outils/ressources/18981c5e-e783-437a-ae82-9a8c88c9e464/++versions++/1/++paras++/2/++ass++/1/++i18n++data:fr?_=1575036432.071749&download=1

actions anthropiques
type: Collection
in scheme: Thesaurus Multirisque FORESTT
member: regulatory measure
member: curative silvicultural action
member: forest management for risk adaptation and management
member: response to protect the forest
member: regulatory classification of forests
member: preventive silviculture
member: choice of species
member: silvicultural action
member: forest planning for risk adaptation and management
member: adapt forest infrastructure
member: choice of provenances
member: adjust stand composition during interventions
member: assisted migration
member: loss of regulating ecosystem service
member: loss of cultural ecosystem service
member: loss of provisioning service
member: loss of supporting ecosystem service
member: loss of carbon stock
member: loss of species habitat
member: loss of emblematic genetic resources
member: restriction of recreational hunting
member: decline in forest recreational use
member: landscape depreciation
member: loss of wood supply
member: loss of genetic material supply
member: loss of non-wood product supply
member: biodiversity erosion
member: access route
member: transport sector
member: human life
member: human health
member: governance measure
member: sustainable management document
member: sensitivity related to silviculture
member: public policy
member: soil compaction
member: poorly managed stand
member: sensitivity to large-scale human actions
member: urbanisation
member: urban planning sector
member: energy sector
member: wildland-urban interface
member: downstream building
member: asset
member: crisis timber management
member: management of invasive alien plant species
member: adaptive forest planning
member: abandonment of forest use
member: intensive silviculture
member: pollution
member: forest ecosystem service
member: land fragmentation
member: mechanisation of forestry work
member: forest overexploitation
member: choice of target species
member: adaptive policy
member: forest policy
member: crisis timber storage
member: trunk wounds
member: poor plantation quality
member: power line
member: adapt the access network

market instability
has status: Published
type: Concept
broader: economic hazard
definition: Fluctuation conjoncturelle des marchés impactant la filière forêt-bois. @fr
definition: Cyclical market fluctuation impacting the forest-wood sector.
in scheme: Thesaurus Multirisque FORESTT
narrower: standing timber price instability
narrower: instability of processed product prices
preferred label: instabilité des marchés @fr
was quoted from: Adapté de Portier (2017) L'instabilité des économies de marché. Revue de l'OFCE, 2017, n° 153, pp. 253-263. [En ligne]. Cairn.info. [Consulté le 07/04/2026]. <URL : https://shs.cairn.info/revue-de-l-ofce-2017-4-page-253?lang=fr> @fr
was quoted from: Adapted from Portier (2017) L'instabilité des économies de marché. Revue de l'OFCE, 2017, n° 153, pp. 253-263. [En ligne]. Cairn.info. [Consulté le 07/04/2026]. <URL : https://shs.cairn.info/revue-de-l-ofce-2017-4-page-253?lang=fr>

waterlogging of the root system in winter soils
has status: Published
type: Concept
alternative label: engorgement hivernal du sol @fr
alternative label: winter soil waterlogging
broader: sensitivity related to soil water status
definition: Excess winter water in the soil causing root asphyxiation.
definition: Excès d’eau hivernal dans le sol provoquant l'asphyxie racinaire. @fr
in scheme: Thesaurus Multirisque FORESTT
preferred label: engorgement du système racinaire hivernal des sols @fr
was quoted from: Adapted from Lévy et Lefèvre (2001). La forêt et sa culture sur sol à nappe temporaire : contraintes subies, choix des essences, interventions et gestion durable. ENGREF, Nancy, 223 p
was quoted from: Adapté de Lévy et Lefèvre (2001). La forêt et sa culture sur sol à nappe temporaire : contraintes subies, choix des essences, interventions et gestion durable. ENGREF, Nancy, 223 p @fr

DSF database
has status: Published
type: Concept
broader: general surveillance
definition: Base de données nationale de suivi de la santé des forêts tenue par le Département Santé des Forêts. @fr
definition: National forest health monitoring database maintained by the Forest Health Department (Département Santé des Forêts).
in scheme: Thesaurus Multirisque FORESTT
preferred label: base données du dsf @fr
was quoted from: Agriculture.gouv.fr. [En ligne]. Paris, Ministère de l’Agriculture. [Consulté le 20/02/2026]. <URL : https://agriculture.gouv.fr/le-departement-de-la-sante-des-forets-role-et-missions>.

forest policy
has status: Published
type: Concept
broader: public policy
definition: Ensemble d'orientations et de principes d'action adoptés par les pouvoirs publics, en accord avec les politiques socio-économiques et environnementales nationales d'un pays donné, afin d'orienter les décisions futures en matière de gestion, d'utilisation et de conservation des forêts dans l'intérêt de la société. @fr
definition: A set of guidelines and principles of action adopted by public authorities, in line with the national socio-economic and environmental policies of a given country, in order to guide future decisions on forest management, use and conservation in the interest of society.
in scheme: Thesaurus Multirisque FORESTT
narrower: amendment of the regionalised list of FRM eligible for state aid
preferred label: politique forestière @fr
was quoted from: Adapté de AGROVOC. Politique forestière. [En ligne]. FAO. [Consulté le 25/03/2026]. <URL : https://agrovoc.fao.org/browse/agrovoc/fr/page/c_3060> @fr
was quoted from: Adapted from AGROVOC. Politique forestière. [En ligne]. FAO. [Consulté le 25/03/2026]. <URL : https://agrovoc.fao.org/browse/agrovoc/fr/page/c_3060>

loss of non-wood products
has status: Published
type: Concept
broader: loss of ecosystem service
definition: Diminution des revenus issus de produits forestiers non-ligneux d'un propriétaire qu'ils soient d’origine végétale (ex. matières premières pour la préparation de médicaments, pour la préparation de colorants, …), ou d’origine animale (ex. animaux comestibles, miel sauvage…). @fr
definition: Decrease in an owner's income from non-wood forest products, whether of plant origin (e.g. raw materials for medicines, dyes...) or animal origin (e.g. edible animals, wild honey...).
in scheme: Thesaurus Multirisque FORESTT
preferred label: perte de produits non-ligneux @fr
was quoted from: Adapté de Géoconfluences. Glossaire : Produits forestiers non ligneux (PFNL). 2024. [En ligne]. ENS de Lyon. [Consulté le 07/04/2026]. <URL : https://geoconfluences.ens-lyon.fr/glossaire/produits-forestiers-non-ligneux-pnfl> @fr
was quoted from: Adapted from Géoconfluences. Glossaire : Produits forestiers non ligneux (PFNL). 2024. [En ligne]. ENS de Lyon. [Consulté le 07/04/2026]. <URL : https://geoconfluences.ens-lyon.fr/glossaire/produits-forestiers-non-ligneux-pnfl>

edaphic drought
has status: Published
type: Concept
broader: drought
definition: Lack of water available in the soil for plants, impacting the whole of plant production and, indirectly, animal production. Edaphic drought is estimated from the terms of the water balance (precipitation, evaporation and evapotranspiration) and soil available water capacity (AWC). Edaphic (soil) drought is also called agricultural drought.
definition: Manque d’eau disponible dans le sol pour les plantes, ce qui impacte toute la production végétale, et indirectement la production animale. La sécheresse édaphique est estimée à partir des termes du bilan hydrique (précipitation, évaporation et évapotranspiration) et de la réserve utile des sols (RU). La sécheresse édaphique, c’est-à-dire du sol, est dite aussi sécheresse agricole. @fr
in scheme: Thesaurus Multirisque FORESTT
narrower: exceptional edaphic drought
preferred label: sécheresse édaphique @fr
was quoted from: Adapted from Lansu et al. (2020). Atmospheric Aridity and Apparent Soil Moisture Drought in European Forest During Heat Waves. Geophysical Research Letters, 47(6), e2020GL087091. [En ligne]. [Consulté le 03/06/2026]. <URL : https://doi.org/10.1029/2020GL087091>
was quoted from: Adapté de Lansu et al. (2020). Atmospheric Aridity and Apparent Soil Moisture Drought in European Forest During Heat Waves. Geophysical Research Letters, 47(6), e2020GL087091. [En ligne]. [Consulté le 03/06/2026]. <URL : https://doi.org/10.1029/2020GL087091> @fr

growth loss
has status: Published
type: Concept
broader: damage characterisation
definition: Réduction de la croissance due à la sécheresse, notamment en peupleraie ou en taillis à courte rotation. @fr
definition: Reduction in growth due to drought, particularly in poplar plantations or short-rotation coppice.
in scheme: Thesaurus Multirisque FORESTT
preferred label: perte de croissance @fr
was quoted from: Groupe de travail « Thésaurus du multirisque en forêt » du projet X-RISKS du PEPR FORESTT (ANR-24-PEFO-0005). [En ligne]. <URL : https://www.pepr-forestt.fr/projets/pc-x-risks> @fr

controlled grazing
has status: Published
type: Concept
broader: silvicultural action
definition: Management of livestock for the maintenance of cleared areas.
definition: Conduite d'un troupeau pour l'entretien des zones débroussaillées. @fr
in scheme: Thesaurus Multirisque FORESTT
preferred label: paturage contrôlé @fr
was quoted from: Adapted from Valette et al. (1993) Forêt Méditerranéenne, tome XIV, n°2, p. 141. [En ligne]. [Consulté le 02/04/2026]. <URL : https://www.foret-mediterraneenne.org/_0/upload/biblio/FORET_MED_1993_2_141.pdf>
was quoted from: Adapté de Valette et al. (1993) Forêt Méditerranéenne, tome XIV, n°2, p. 141. [En ligne]. [Consulté le 02/04/2026]. <URL : https://www.foret-mediterraneenne.org/_0/upload/biblio/FORET_MED_1993_2_141.pdf> @fr

foliage pest insect
has status: Published
type: Concept
broader: pest insect
definition: Insect feeding on leaves or needles.
definition: Insecte se nourrissant des feuilles ou aiguilles. @fr
in scheme: Thesaurus Multirisque FORESTT
narrower: piercing-sucking insect
narrower: skeletoniser
narrower: gall-forming insect
narrower: chewing insect
narrower: leaf miner
narrower: leafroller
preferred label: insecte ravageur du feuillage @fr
was quoted from: EPHYTIA-INRAE. [En ligne]. [Consulté le 20/02/2026]. <URL : https://ephytia.inrae.fr/fr/C/18521/Forets-Champignons-et-autres-pathogenes>.

spotting
has status: Published
type: Concept
broader: hazard characterisation
definition: Propagation de l’incendie par éclosion de foyers secondaires déclenchés à l'extérieur du périmètre du feu principal par des brandons transportés dans la colonne de convection de l’incendie. @fr
definition: Spread of a fire through the ignition of secondary outbreaks triggered outside the perimeter of the main fire by firebrands carried in the fire's convection column.
in scheme: Thesaurus Multirisque FORESTT
preferred label: saute de feu @fr

national FRM regulation
has status: Published
type: Concept
broader: regulatory measure
definition: Transposition en droit français de la directive européenne 1999/105/CE concernant la commercialisation des matériels forestiers de reproduction (MFR), établissant un cadre réglementaire pour garantir la qualité génétique des plantations. @fr
definition: Transposition into French law of European Directive 1999/105/EC on the marketing of forest reproductive material (FRM), establishing a regulatory framework to guarantee the genetic quality of plantations.
in scheme: Thesaurus Multirisque FORESTT
narrower: regional recommendation sheet
preferred label: règlement national mfr @fr
was quoted from: Adapté de GEVES. Réglementation des matériels forestiers de reproduction (MFR). [En ligne]. Groupe d’Étude et de contrôle des Variétés et des Semences, rubrique Expertises variétés et semences - Espèces forestières. [Consulté le 25/03/2026]. <URL : https://www.geves.fr/expertises-varietes-semences/especes-forestieres/reglementation-materiels-forestiers-de-reproduction/> @fr
was quoted from: Adapted from GEVES. Réglementation des matériels forestiers de reproduction (MFR). [En ligne]. Groupe d’Étude et de contrôle des Variétés et des Semences, rubrique Expertises variétés et semences - Espèces forestières. [Consulté le 25/03/2026]. <URL : https://www.geves.fr/expertises-varietes-semences/especes-forestieres/reglementation-materiels-forestiers-de-reproduction/>

heatwave duration
has status: Published
type: Concept
broader: hazard characterisation
definition: Période mesurable pendant laquelle a lieu une vague de chaleur. @fr
definition: Measurable period during which a heatwave occurs.
in scheme: Thesaurus Multirisque FORESTT
preferred label: durée de la vague de chaleur @fr
was quoted from: Adapté de Info.gouv.fr. Canicule et vagues de chaleur. [En ligne]. Paris, Gouvernement. [Consulté le 20/02/2026]. <URL : https://www.info.gouv.fr/risques/canicule-et-vagues-de-chaleur>. @fr
was quoted from: Adapted from Info.gouv.fr. Canicule et vagues de chaleur. [En ligne]. Paris, Gouvernement. [Consulté le 20/02/2026]. <URL : https://www.info.gouv.fr/risques/canicule-et-vagues-de-chaleur>.

prioritisation for other sectors
has status: Published
type: Concept
broader: land use planning
definition: Priorité donnée à d’autres usages du sol (énergie, transport, urbanisation) affectant la ressource en bois et l'approvisionnement de la filière forêt-bois. @fr
definition: Priority given to other land uses (energy, transport, urbanisation) affecting the wood resource and the supply of the forest-wood sector.
in scheme: Thesaurus Multirisque FORESTT
preferred label: priorisation à d'autres secteurs @fr
was quoted from: Adapté de WWF France. Enchantées ou désenchantées : quelles forêts françaises en 2100 ? 2025. [En ligne]. WWF. [Consulté le 07/04/2026]. <URL : https://www.wwf.fr/sites/default/files/doc-2025-03/FORETS%20ENCHANTE%CC%81ES%20FINAL%20BASSE%20DEF.pdf> @fr
was quoted from: Adapted from WWF France. Enchantées ou désenchantées : quelles forêts françaises en 2100 ? 2025. [En ligne]. WWF. [Consulté le 07/04/2026]. <URL : https://www.wwf.fr/sites/default/files/doc-2025-03/FORETS%20ENCHANTE%CC%81ES%20FINAL%20BASSE%20DEF.pdf>

non-fungal phytopathogenic agent
has status: Published
type: Concept
broader: plant pathogen
definition: Organismes fongiformes voisins des champignons "vrais" causant des dommages, en particulier les oomycètes. @fr
definition: Fungus-like organisms related to "true" fungi causing damage, in particular oomycetes.
in scheme: Thesaurus Multirisque FORESTT
narrower: pathogenic virus
narrower: phytopathogenic bacterium
narrower: nematode
narrower: oomycete disease
narrower: parasitic plant
preferred label: agent phytopathogène non fongique @fr
was quoted from: Adapté de EPHYTIA-INRAE. Champignons et autres pathogènes. [En ligne]. [Consulté le 20/02/2026]. <URL : https://ephytia.inrae.fr/fr/c/18521/forets-champignons-et-autres-pathogenes>. @fr
was quoted from: Adapted from EPHYTIA-INRAE. Champignons et autres pathogènes. [En ligne]. [Consulté le 20/02/2026]. <URL : https://ephytia.inrae.fr/fr/c/18521/forets-champignons-et-autres-pathogenes>.

multi-risk approach
has status: Published
type: Concept
broader: multi-risk
definition: Multi-risk analysis process taking into account the interactions between risks.
definition: Démarche d'analyse multirisque prenant en compte les interactions entre risques. @fr
in scheme: Thesaurus Multirisque FORESTT
narrower: risk interdependence
narrower: multi-risk assessment method
narrower: integrated multi-risk management strategy
narrower: multi-risk interactions
preferred label: approche multirisque @fr
was quoted from: Groupe de travail « Thésaurus du multirisque en forêt » du projet X-RISKS du PEPR FORESTT (ANR-24-PEFO-0005). [En ligne]. <URL : https://www.pepr-forestt.fr/projets/pc-x-risks> @fr

shortening of the rotation
has status: Published
type: Concept
broader: sustainable management document
definition: Réduire le nombre d’années avant la récolte finale pour écourter la période d’exposition aux aléas climatiques des arbres trop âgés, plus vulnérables et favoriser par une régénération continue ou accélérée la sélection plus rapide des gènes les mieux adaptés au climat changeant. @fr
definition: Reducing the number of years before final harvest to shorten the period of exposure to climatic hazards for older, more vulnerable trees, and to favour, through continuous or accelerated regeneration, the faster selection of genes best adapted to the changing climate.
in scheme: Thesaurus Multirisque FORESTT
preferred label: réduction de la révolution @fr
was quoted from: Adapté de INRAE. Adaptation, les pistes d’action. [En ligne]. INRAE, dossier « Quelles gestions des forêts pour demain ? », publié le 21 juin 2022. [Consulté le 25/03/2026]. <URL : https://www.inrae.fr/dossiers/quelles-gestions-forets-demain/adaptation-pistes-daction> @fr
was quoted from: Adapted from INRAE. Adaptation, les pistes d’action. [En ligne]. INRAE, dossier « Quelles gestions des forêts pour demain ? », publié le 21 juin 2022. [Consulté le 25/03/2026]. <URL : https://www.inrae.fr/dossiers/quelles-gestions-forets-demain/adaptation-pistes-daction>

diversification of land use at massif scale
has status: Published
type: Concept
broader: governance measure
definition: Change in land use within a forest massif to reduce risks.
definition: Changement d’affectation des sols dans un massif forestier pour réduire les risques. @fr
in scheme: Thesaurus Multirisque FORESTT
preferred label: diversification de l'usage du sol à l'échelle du massif @fr
was quoted from: Adapted from Commissariat général au développement durable. Changements d'utilisation des sols. [En ligne]. notre-environnement.gouv.fr, 2019. [Consulté le 01/04/2026]. <URL : https://www.notre-environnement.gouv.fr/themes/biodiversite/les-sols-et-sous-sols/article/changements-d-utilisation-des-sols#Situation-de-la-France>
was quoted from: Adapté de Commissariat général au développement durable. Changements d'utilisation des sols. [En ligne]. notre-environnement.gouv.fr, 2019. [Consulté le 01/04/2026]. <URL : https://www.notre-environnement.gouv.fr/themes/biodiversite/les-sols-et-sous-sols/article/changements-d-utilisation-des-sols#Situation-de-la-France> @fr

trigger
has status: Published
modified: 2026-08-03T15:15:42.545
type: Concept
alternative label: événement déclencheur @fr
alternative label: triggering event
broader: sequential risks
in scheme: Thesaurus Multirisque FORESTT
preferred label: déclencheur @fr

windsnap top
has status: Published
type: Concept
broader: storm-damaged timber
definition: Partie supérieure d’un arbre brisé par le vent. @fr
definition: Upper part of a tree broken by wind.
in scheme: Thesaurus Multirisque FORESTT
preferred label: volis @fr
was quoted from: Adapté de EPHYTIA-INRAE. [En ligne]. [Consulté le 20/02/2026]. <URL : https://ephytia.inra.fr/fr/C/18551/Forets-Vent-tempetes> @fr
was quoted from: Adapted from EPHYTIA-INRAE. [En ligne]. [Consulté le 20/02/2026]. <URL : https://ephytia.inra.fr/fr/C/18551/Forets-Vent-tempetes>

aggressiveness
has status: Published
type: Concept
broader: disease severity
definition: Pouvoir pathogénique du champignon mesuré par l'ampleur des lésions causées chez son hôte. @fr
definition: Pathogenic power of a fungus measured by the extent of the lesions it causes in its host.
in scheme: Thesaurus Multirisque FORESTT
preferred label: agressivité @fr
was quoted from: Groupe de travail « Thésaurus du multirisque en forêt » du projet X-RISKS du PEPR FORESTT (ANR-24-PEFO-0005). [En ligne]. <URL : https://www.pepr-forestt.fr/projets/pc-x-risks> @fr

root system waterlogging intensity
has status: Published
type: Concept
broader: hazard characterisation
definition: Degré de saturation en eau du sol. @fr
definition: Degree of soil water saturation.
in scheme: Thesaurus Multirisque FORESTT
narrower: near-surface water table depth
preferred label: intensité d'engorgement du système racinaire @fr
was quoted from: Adapté de ONF (2005) RDVT 73-22-28. [En ligne]. [Consulté le 20/02/2026]. <URL : https://old.foretnature.be/images/stories/pdffolder/FO163-SOLS-BIBLIO-6-ONF_RDVT_73-22-28.pdf>. @fr
was quoted from: Adapted from ONF (2005) RDVT 73-22-28. [En ligne]. [Consulté le 20/02/2026]. <URL : https://old.foretnature.be/images/stories/pdffolder/FO163-SOLS-BIBLIO-6-ONF_RDVT_73-22-28.pdf>.

nematode
has status: Published
type: Concept
broader: non-fungal phytopathogenic agent
definition: Vers ronds omniprésents sur la planète, dont les plus petits sont microscopiques, tandis que les plus grands peuvent atteindre plusieurs centimètres. 60% des espèces de nématodes sont des parasites d'animaux ou de végétaux et une infime proportion peuvent provoquer des dégâts, mais parfois considérables, comme le nématode du pin. @fr
definition: Roundworms present throughout the planet, the smallest of which are microscopic while the largest can reach several centimetres. 60% of nematode species are parasites of animals or plants, and a small proportion can cause damage, sometimes considerable, such as the pine wood nematode.
in scheme: Thesaurus Multirisque FORESTT
preferred label: nématode @fr

low tree elasticity
has status: Published
type: Concept
broader: individual factor
definition: Faible capacité d'un arbre à revenir à sa forme initiale après déformation par un aléa gravitaire. @fr
definition: Low capacity of a tree to return to its original shape after deformation by a gravitational hazard.
in scheme: Thesaurus Multirisque FORESTT
preferred label: faible élasticité de l'arbre @fr
was quoted from: Adapté de FAO Agrovoc. [En ligne]. Rome, FAO. [Consulté le 20/02/2026]. <URL : https://agrovoc.fao.org/browse/agrovoc/fr/page/c_26777>. @fr
was quoted from: Adapted from FAO Agrovoc. [En ligne]. Rome, FAO. [Consulté le 20/02/2026]. <URL : https://agrovoc.fao.org/browse/agrovoc/fr/page/c_26777>.

forest weather forecast
has status: Published
type: Concept
broader: general surveillance
definition: Information à destination du grand public du niveau quotidien de danger pendant la saison feux de forêt. @fr
definition: Information for the general public on the daily danger level during the forest fire season.
in scheme: Thesaurus Multirisque FORESTT
preferred label: météo des forêts @fr
was quoted from: Adapté de Observatoire des forêts françaises. Évaluer le niveau de risque. 2024. [En ligne]. Observatoire des forêts françaises. [Consulté le 02/04/2026]. <URL : https://observatoire.foret.gouv.fr/themes/evaluer-le-niveau-de-risque> @fr
was quoted from: Adapted from Observatoire des forêts françaises. Évaluer le niveau de risque. 2024. [En ligne]. Observatoire des forêts françaises. [Consulté le 02/04/2026]. <URL : https://observatoire.foret.gouv.fr/themes/evaluer-le-niveau-de-risque>

spore trapping
has status: Published
type: Concept
broader: general surveillance
definition: Dispositif de collecte permettant d'échantillonner les spores fongiques présentes dans l'environnement à des fins de surveillance, d'identification ou d'étude de leur dispersion. @fr
definition: Collection device allowing fungal spores present in the environment to be sampled for surveillance, identification or dispersal study purposes.
in scheme: Thesaurus Multirisque FORESTT
preferred label: piégeage de spores @fr
was quoted from: Groupe de travail « Thésaurus du multirisque en forêt » du projet X-RISKS du PEPR FORESTT (ANR-24-PEFO-0005). [En ligne]. <URL : https://www.pepr-forestt.fr/projets/pc-x-risks> @fr

chewing insect
has status: Published
type: Concept
alternative label: brouteuse @fr
alternative label: grazer
broader: foliage pest insect
definition: Insecte dont les pièces buccales permettent de broyer les tissus végétaux. @fr
definition: Insect whose mouthparts allow it to chew plant tissue.
in scheme: Thesaurus Multirisque FORESTT
preferred label: macheuse @fr
was quoted from: Frederick Forestry Board. Chewing insects. [En ligne]. [Consulté le 20/02/2026]. <URL : https://frederick.forestryboard.org/nature-notes/animals/insects/insect-series/chewing-insects>. @fr

fine, dry leaf
has status: Published
type: Concept
broader: high combustibility
definition: Fine, dry and divided leaf increasing litter flammability.
definition: Feuille fine, sèche et divisée augmentant l’inflammabilité de la litière. @fr
in scheme: Thesaurus Multirisque FORESTT
preferred label: feuille fine et sèche @fr
was quoted from: Adapté de Revertegat et al. (2025) Synthèse sur la vulnérabilité des peuplements forestiers au feu. Rapport final du projet AFORCE VULNEFEU (Vulnefeu04). [En ligne]. Réseau AFORCE, 2025. [Consulté le 25/03/2026]. <URL : https://www.reseau-aforce.fr/sites/reseau-aforce/files/2025-07/Rapport-Vulnefeu04-compressed.pdf @fr
was quoted from: Adapted from Revertegat et al. (2025) Synthèse sur la vulnérabilité des peuplements forestiers au feu. Rapport final du projet AFORCE VULNEFEU (Vulnefeu04). [En ligne]. Réseau AFORCE, 2025. [Consulté le 25/03/2026]. <URL : https://www.reseau-aforce.fr/sites/reseau-aforce/files/2025-07/Rapport-Vulnefeu04-compressed.pdf

seed and seedling fungal disease
has status: Published
type: Concept
broader: fungal phytopathogenic agent
definition: Champignon microscopique qui se développe dans les tissus, tuant les cellules et amenant ainsi le ralentissement ou la cessation des fonctions essentielles de la graine ou de la jeune plante. @fr
definition: Microscopic fungus that develops within tissues, killing cells and thereby slowing down or halting the essential functions of the seed or young plant.
in scheme: Thesaurus Multirisque FORESTT
preferred label: maladie fongique des graines et des plantules @fr
was quoted from: Groupe de travail « Thésaurus du multirisque en forêt » du projet X-RISKS du PEPR FORESTT (ANR-24-PEFO-0005). [En ligne]. <URL : https://www.pepr-forestt.fr/projets/pc-x-risks> @fr

felling of a contaminated tree
has status: Published
type: Concept
broader: control measure
definition: Abattage obligatoire des arbres porteurs d’un pathogène. @fr
definition: Mandatory felling of trees carrying a pathogen.
in scheme: Thesaurus Multirisque FORESTT
preferred label: abattage d'arbre contaminé @fr
was quoted from: Adapté de Plan national d'intervention sanitaire d'urgence relatif à Bursaphelenchus xylophilus (nématode du pin). [En ligne]. [Consulté le 20/02/2026]. <URL : https://info.agriculture.gouv.fr/boagri/instruction-2019-209>. @fr
was quoted from: Adapted from Plan national d'intervention sanitaire d'urgence relatif à Bursaphelenchus xylophilus (nématode du pin). [En ligne]. [Consulté le 20/02/2026]. <URL : https://info.agriculture.gouv.fr/boagri/instruction-2019-209>.

commensurable risks
has status: Published
type: Concept
broader: multi-risk assessment method
definition: Risks that can be expressed in the same unit so that the sum of their values is interpretable.
definition: Risques qui peuvent être exprimés dans la même unité de sorte que la somme de leurs valeurs soit interprétable. @fr
in scheme: Thesaurus Multirisque FORESTT
preferred label: risques commensurables @fr
was quoted from: Groupe de travail « Thésaurus du multirisque en forêt » du projet X-RISKS du PEPR FORESTT (ANR-24-PEFO-0005). [En ligne]. <URL : https://www.pepr-forestt.fr/projets/pc-x-risks> @fr

root pest insect
has status: Published
type: Concept
broader: pest insect
definition: Organisme se nourrissant des racines. @fr
definition: Organism feeding on roots.
in scheme: Thesaurus Multirisque FORESTT
narrower: root cambium-feeding insect
narrower: root xylem-feeding insect
preferred label: insecte ravageur des racines @fr
was quoted from: Adapté de Bouget et al. (2005) Nomenclature des groupes écologiques d’insectes liés au bois. [En ligne]. Paris, Comptes Rendus Biologies. [Consulté le 20/02/2026]. <URL : https://doi.org/10.1016/j.crvi.2005.08.003>. @fr
was quoted from: Adapted from Bouget et al. (2005) Nomenclature des groupes écologiques d’insectes liés au bois. [En ligne]. Paris, Comptes Rendus Biologies. [Consulté le 20/02/2026]. <URL : https://doi.org/10.1016/j.crvi.2005.08.003>.

clear-cutting
has status: Published
type: Concept
broader: sensitivity related to silviculture
definition: Les arbres de même âge ayant poussé en même temps (futaie régulière) sont coupés en une seule fois, sans que les jeunes pousses soient encore installées. @fr
definition: Trees of the same age that grew together (even-aged high forest) are all cut at once, before young growth has become established.
in scheme: Thesaurus Multirisque FORESTT
preferred label: coupe rase @fr
was quoted from: Adapté de Landmann, Delay et Marquet (Coord.) (2023). Expertise collective CRREF - Coupes rases et renouvellement des peuplements forestiers en contexte de changement climatique. Rapport scientifique, GIP ECOFOR / RMT AFORCE, 782 p. @fr
was quoted from: Adapted from Landmann, Delay et Marquet (Coord.) (2023). Expertise collective CRREF - Coupes rases et renouvellement des peuplements forestiers en contexte de changement climatique. Rapport scientifique, GIP ECOFOR / RMT AFORCE, 782 p.

strong competition from accompanying vegetation
has status: Published
type: Concept
broader: reproduction deficit
definition: Post-disturbance regeneration difficulty due to strong competition limiting seedling growth.
definition: Difficulté de régénération post-perturbation du fait d'une compétition forte limitant la croissance des semis. @fr
in scheme: Thesaurus Multirisque FORESTT
preferred label: forte concurrence de la végétation accompagnatrice @fr
was quoted from: Adapted from Fortier et al. (2005). La problématique de l'utilisation des herbicides en foresterie : le cas du Québec. VertigO - la revue électronique en sciences de l'environnement, 2005, vol. 6, n° 2. [En ligne]. OpenEdition Journals. [Consulté le 07/04/2026]. <URL : https://journals.openedition.org/vertigo/4372>
was quoted from: Adapté de Fortier et al. (2005). La problématique de l'utilisation des herbicides en foresterie : le cas du Québec. VertigO - la revue électronique en sciences de l'environnement, 2005, vol. 6, n° 2. [En ligne]. OpenEdition Journals. [Consulté le 07/04/2026]. <URL : https://journals.openedition.org/vertigo/4372> @fr

fire activity
has status: Published
type: Concept
broader: hazard characterisation
definition: Measure of fire danger combining the number of fires in a given area over a given period and the area they burned.
definition: Mesure du danger d'incendie combinant le nombre d'incendies sur une zone et pendant une période de temps données et leurs surfaces parcourues. @fr
in scheme: Thesaurus Multirisque FORESTT
preferred label: activité des feux @fr

tempête
type: Collection
in scheme: Thesaurus Multirisque FORESTT
member: storm-damaged timber
member: windthrow
member: windsnap top
member: critical wind speed
member: shallow tree rooting depth
member: early budburst
member: deciduous foliage
member: violent wind
member: wind gust speed
member: derecho
member: tornado
member: storm
member: sensitivity related to soil water status
member: shortening of the rotation
member: diversification of treatments
member: discontinuous canopy
member: landscape fragmentation
member: edge shape

associational resistance
has status: Published
type: Concept
broader: use of accompanying vegetation
definition: Utilisation de l'associaion de plusieurs espèces d'arbres pour renforcer la résistance et la résilience collective du peuplement aux insectes ravageurs des forêts. @fr
definition: Use of a mix of several tree species to strengthen the collective resistance and resilience of the stand to forest pest insects.
in scheme: Thesaurus Multirisque FORESTT
preferred label: résistance par association @fr
was quoted from: Adapté de INRAE. Forêts mélangées : lutter contre les insectes ravageurs grâce à la diversité. [En ligne]. Publié le 19 octobre 2021. [Consulté le 25/03/2026]. <URL : https://www.inrae.fr/actualites/forets-melangees-lutter-contre-insectes-ravageurs> @fr
was quoted from: Adapted from INRAE. Forêts mélangées : lutter contre les insectes ravageurs grâce à la diversité. [En ligne]. Publié le 19 octobre 2021. [Consulté le 25/03/2026]. <URL : https://www.inrae.fr/actualites/forets-melangees-lutter-contre-insectes-ravageurs>

landscape fragmentation
has status: Published
type: Concept
broader: structural heterogeneity
definition: Heterogeneous landscapes divided into non-contiguous zones.
definition: Paysages hétérogènes divisés en zones non jointives. @fr
in scheme: Thesaurus Multirisque FORESTT
preferred label: fragmentation paysage @fr
was quoted from: Adapted from Gaucherel (2007) La fragmentation du paysage. Plume !, 2007, n° 4, p. 12. [En ligne]. HAL open science, hal-02661068. [Consulté le 25/03/2026]. <URL : https://hal.inrae.fr/hal-02661068>
was quoted from: Adapté de Gaucherel (2007) La fragmentation du paysage. Plume !, 2007, n° 4, p. 12. [En ligne]. HAL open science, hal-02661068. [Consulté le 25/03/2026]. <URL : https://hal.inrae.fr/hal-02661068> @fr

sensitivity related to water conditions
has status: Published
type: Concept
alternative label: sensibilité à l'état hydrique @fr
alternative label: sensitivity to water status
broader: sensitivity related to site conditions
definition: Extent to which a forest ecosystem is affected by a hazard due to the water status of the soil and atmosphere.
definition: Mesure dans laquelle un écosystème forestier est affecté par un aléa du fait de l’état hydrique du sol et de l’atmosphère. @fr
in scheme: Thesaurus Multirisque FORESTT
narrower: sensitivity related to soil water status
narrower: soil with low available water capacity
narrower: hydromorphic soil
narrower: capillary rise
preferred label: sensibilité liée aux conditions hydriques @fr
was quoted from: Adapté de Plantes-et-eau.fr. [En ligne]. [Consulté le 20/02/2026]. <URL : https://www.plantes-et-eau.fr/documentation/outils-et-concepts-de-base/17-le-sol-reservoir-d-eau-pour-les-plantes/119-les-relations-potentiel-hydrique-humidite-dans-un-sol>. @fr
was quoted from: Adapted from Plantes-et-eau.fr. [En ligne]. [Consulté le 20/02/2026]. <URL : https://www.plantes-et-eau.fr/documentation/outils-et-concepts-de-base/17-le-sol-reservoir-d-eau-pour-les-plantes/119-les-relations-potentiel-hydrique-humidite-dans-un-sol>.

suppressed tree
has status: Published
type: Concept
broader: social status of the tree
definition: Arbre dont la surface planimétrique de la projection verticale de la partie du houppier qui n’est pas surplombée par le feuillage d’autres arbres en période de feuillaison est inférieur à 2/3 de son couvert total. @fr
definition: Tree whose planimetric surface of the vertical projection of the crown part not overhung by the foliage of other trees during the leafy period is less than 2/3 of its total cover.
in scheme: Thesaurus Multirisque FORESTT
preferred label: arbre dominé @fr
was quoted from: Adapté de IGN. Inventaire forestier. [En ligne]. [Consulté le 20/02/2026]. <URL : https://inventaire-forestier.ign.fr/spip.php?article601>. @fr
was quoted from: Adapted from IGN. Inventaire forestier. [En ligne]. [Consulté le 20/02/2026]. <URL : https://inventaire-forestier.ign.fr/spip.php?article601>.

amendment of the regionalised list of FRM eligible for state aid
has status: Published
type: Concept
broader: forest policy
definition: Mise à jour des arrêtés régionaux sur les matériels forestiers de reproduction. @fr
definition: Update of regional orders on forest reproductive material.
in scheme: Thesaurus Multirisque FORESTT
preferred label: modification de la liste régionalisée des MFR éligibles aux aides de l’état @fr
was quoted from: Adapté de Ministère de l’Agriculture. [En ligne]. Paris, Ministère de l’Agriculture. [Consulté le 20/02/2026]. <URL : https://agriculture.gouv.fr/materiels-forestiers-de-reproduction-arretes-regionaux-relatifs-aux-aides-de-letat-linvestissement>. @fr
was quoted from: Adapted from Ministère de l’Agriculture. [En ligne]. Paris, Ministère de l’Agriculture. [Consulté le 20/02/2026]. <URL : https://agriculture.gouv.fr/materiels-forestiers-de-reproduction-arretes-regionaux-relatifs-aux-aides-de-letat-linvestissement>.

frost pocket
has status: Published
type: Concept
broader: sensitivity related to topography
definition: Dépression topographique où l’air froid s’accumule favorisant les gelées. @fr
definition: Topographic depression where cold air accumulates, favouring frost.
in scheme: Thesaurus Multirisque FORESTT
preferred label: trou à gelée @fr
was quoted from: Adapté de Vitrinelinguistique.oqlf.gouv.qc.ca. Trou de gelée. [En ligne]. Québec, OQLF. [Consulté le 20/02/2026]. <URL : https://vitrinelinguistique.oqlf.gouv.qc.ca/fiche-gdt/fiche/8479358/trou-de-gelee>. @fr
was quoted from: Adapted from Vitrinelinguistique.oqlf.gouv.qc.ca. Trou de gelée. [En ligne]. Québec, OQLF. [Consulté le 20/02/2026]. <URL : https://vitrinelinguistique.oqlf.gouv.qc.ca/fiche-gdt/fiche/8479358/trou-de-gelee>.

landslide
has status: Published
type: Concept
broader: slow ground movement
definition: Mouvement de terrain se produisant généralement en situation de forte saturation des sols en eau, peuvant mobiliser des volumes considérables de terrain, qui se déplacent le long d’une surface de rupture. @fr
definition: Ground movement generally occurring under conditions of high soil water saturation, capable of mobilising considerable volumes of ground, which move along a failure surface.
in scheme: Thesaurus Multirisque FORESTT
preferred label: glissement de terrain @fr
was quoted from: Adapté de Ministère de la Transition écologique. Les mouvements de terrain. 2026. [En ligne]. Ministère de la Transition écologique. [Consulté le 03/06/2026]. <URL : https://www.ecologie.gouv.fr/politiques-publiques/mouvements-terrain> @fr
was quoted from: Adapted from Ministère de la Transition écologique. Les mouvements de terrain. 2026. [En ligne]. Ministère de la Transition écologique. [Consulté le 03/06/2026]. <URL : https://www.ecologie.gouv.fr/politiques-publiques/mouvements-terrain>

plant passport
has status: Published
type: Concept
broader: regulatory measure
definition: Document containing the essential information required for the trade of seeds, cuttings, plants and trees between EU businesses.
definition: Document qui contient les informations essentielles requises pour le commerce de semences, de boutures, de végétaux et d’arbres entre les entreprises de l’UE. @fr
in scheme: Thesaurus Multirisque FORESTT
preferred label: passeport phytosanitaire @fr
was quoted from: Adapted from EFSA. Passeports phytosanitaires. [En ligne]. [Consulté le 25/03/2026]. <URL : https://www.efsa.europa.eu/fr/plh4l/plant-passports>
was quoted from: Adapté de EFSA. Passeports phytosanitaires. [En ligne]. [Consulté le 25/03/2026]. <URL : https://www.efsa.europa.eu/fr/plh4l/plant-passports> @fr

root damage
has status: Published
type: Concept
broader: damage characterisation
definition: Blessures des racines favorisant pourriture. @fr
definition: Root injuries promoting decay.
in scheme: Thesaurus Multirisque FORESTT
preferred label: dommage aux racines @fr
was quoted from: Adapté de RNCan - Service canadien des forêts. Glossaire forestier : Sylviculture intensive. [En ligne]. 2019. [Consulté le 25/03/2026]. <URL : https://scf.rncan.gc.ca/termes/vue/207> @fr
was quoted from: Adapted from RNCan - Service canadien des forêts. Glossaire forestier : Sylviculture intensive. [En ligne]. 2019. [Consulté le 25/03/2026]. <URL : https://scf.rncan.gc.ca/termes/vue/207>

multi-risk measure
has status: Published
type: Concept
broader: multi-risk assessment method
definition: Nombre ou quantité qui rend compte d'un niveau de multirisque, et qui est associé à une unité. @fr
definition: Number or quantity that reflects a level of multi-risk, and which is associated with a unit.
in scheme: Thesaurus Multirisque FORESTT
preferred label: mesure de multirisque @fr
was quoted from: Groupe de travail « Thésaurus du multirisque en forêt » du projet X-RISKS du PEPR FORESTT (ANR-24-PEFO-0005). [En ligne]. <URL : https://www.pepr-forestt.fr/projets/pc-x-risks> @fr

buffer zone with respect to pine wood nematode
has status: Published
type: Concept
broader: national emergency health intervention plan (PNISU) for Bursaphelenchus xylophilus (pine wood nematode)
definition: Zone surrounding a zone infested by the pine wood nematode to limit its spread.
definition: Zone entourant une zone infestée par le nématode du pin pour limiter sa dissémination. @fr
in scheme: Thesaurus Multirisque FORESTT
preferred label: zone tampon vis-à-vis du nématode du pin @fr
was quoted from: Adapté de Ministère de l’Agriculture. Instruction DGAL/SDQSPV/2019-209 (Plan national d’intervention sanitaire d’urgence - Nématode du pin). [En ligne]. 2019. [Consulté le 25/03/2026]. <URL : https://info.agriculture.gouv.fr/boagri/instruction-2019-209> @fr
was quoted from: Adapted from Ministère de l’Agriculture. Instruction DGAL/SDQSPV/2019-209 (Plan national d’intervention sanitaire d’urgence - Nématode du pin). [En ligne]. 2019. [Consulté le 25/03/2026]. <URL : https://info.agriculture.gouv.fr/boagri/instruction-2019-209>

observer network (DSF)
has status: Published
type: Concept
broader: general surveillance
definition: Network of trained professionals ensuring forest health surveillance through the observation, reporting and monitoring of bioagressors and forest decline.
definition: Réseau de professionnels formés assurant la surveillance sanitaire des forêts par l'observation, le signalement et le suivi des bioagresseurs et des dépérissements. @fr
in scheme: Thesaurus Multirisque FORESTT
preferred label: réseau d'observateurs (dsf) @fr
was quoted from: Agriculture.gouv.fr. [En ligne]. Paris, Ministère de l’Agriculture. [Consulté le 20/02/2026]. <URL : https://agriculture.gouv.fr/le-departement-de-la-sante-des-forets-role-et-missions>.

pathogène
type: Collection
in scheme: Thesaurus Multirisque FORESTT
member: rust fungal disease
member: fungal phytopathogenic agent
member: plant pathogen
member: root and collar pathogen
member: trunk pathogen
member: canker fungal disease
member: twig and shoot blight fungus
member: foliar fungal disease
member: seed and seedling fungal disease
member: vascular fungus
member: bark susceptible to pine wood nematode
member: sensitive host
member: host species
member: plant contaminated by pine wood nematode
member: plant susceptible to pine wood nematode
member: plant identified with respect to pine wood nematode
member: asymptomatic tree
member: wood susceptible to pine wood nematode
member: harvest residue with respect to the nematode
member: suspected outbreak
member: outbreak focus
member: outbreak confirmation
member: designated establishment with respect to the nematode
member: pure stand
member: lesion size
member: canker size
member: fine root loss
member: resistant host
member: tolerant host
member: reservoir host
member: non-fungal phytopathogenic agent
member: vascular pathogen
member: pathogenic virus
member: phytopathogenic bacterium
member: nematode
member: oomycete disease
member: parasitic plant
member: disease emergence
member: prevalence
member: pathogen prevalence
member: aggressiveness
member: disease severity
member: quarantine organism
member: priority quarantine organism
member: virulence
member: pathogenicity
member: loss of wood quality
member: wood blue stain
member: growth loss
member: stump treatment
member: zone infested by pine wood nematode
member: buffer zone with respect to pine wood nematode
member: demarcated zone with respect to pine wood nematode
member: contaminated tree
member: control measure
member: felling of a contaminated tree
member: ISPM 15 phytosanitary standard
member: spore trapping
member: epidemic
member: primary pest
member: secondary pest

sexual immaturity
has status: Published
type: Concept
broader: reproduction deficit
definition: Difficulté de régénération post-perturbation du fait de l'absence de maturité sexuelle des individus. @fr
definition: Post-disturbance regeneration difficulty due to individuals lacking sexual maturity.
in scheme: Thesaurus Multirisque FORESTT
preferred label: immaturité sexuelle @fr
was quoted from: Groupe de travail « Thésaurus du multirisque en forêt » du projet X-RISKS du PEPR FORESTT (ANR-24-PEFO-0005). [En ligne]. <URL : https://www.pepr-forestt.fr/projets/pc-x-risks> @fr

emergency plan
has status: Published
type: Concept
broader: crisis management plan
definition: Document fil directeur déroulant l'organisation des actions lors des différentes phases d'une crise majeure. @fr
definition: Guiding document setting out the organisation of actions during the different phases of a major crisis.
in scheme: Thesaurus Multirisque FORESTT
preferred label: plan d'urgence @fr
was quoted from: Adapté de Ministère de l’Agriculture et de la Souveraineté alimentaire. Plan national de gestion de crise tempête pour la filière forêt-bois. [En ligne]. 21 septembre 2018. [Consulté le 25/03/2026]. <URL : https://agriculture.gouv.fr/plan-national-de-gestion-de-crise-tempete-pour-la-filiere-foret-bois> @fr
was quoted from: Adapted from Ministère de l’Agriculture et de la Souveraineté alimentaire. Plan national de gestion de crise tempête pour la filière forêt-bois. [En ligne]. 21 septembre 2018. [Consulté le 25/03/2026]. <URL : https://agriculture.gouv.fr/plan-national-de-gestion-de-crise-tempete-pour-la-filiere-foret-bois>

economic hazard
has status: Published
type: Concept
broader: hazard threatening the wood industry
definition: Éventualité d’une tendance ou d’un phénomène physique, naturel ou anthropique, susceptible d’entraîner des pertes économiques. @fr
definition: The potential occurrence of a natural or human-induced physical trend or phenomenon likely to cause economic losses.
in scheme: Thesaurus Multirisque FORESTT
narrower: market instability
narrower: actor failure
narrower: decline in financial support
narrower: pressure on the wood resource
preferred label: aléa économique @fr
was quoted from: Adapté de GIEC (2018) Glossaire. Rapport spécial sur les conséquences d’un réchauffement planétaire de 1,5 °C. [En ligne]. Genève, GIEC. [Consulté le 20/02/2026]. <URL : https://www.ipcc.ch/site/assets/uploads/sites/2/2019/10/SR15_Glossary_french.pdf>. @fr
was quoted from: Adapted from GIEC (2018) Glossaire. Rapport spécial sur les conséquences d’un réchauffement planétaire de 1,5 °C. [En ligne]. Genève, GIEC. [Consulté le 20/02/2026]. <URL : https://www.ipcc.ch/site/assets/uploads/sites/2/2019/10/SR15_Glossary_french.pdf>.

interacting risks
has status: Published
type: Concept
broader: multi-risk
definition: Term for complex risks used in disciplines such as geophysics or physical geography, referring to the set of physical relationships underlying risks that develop in the natural environment, as well as their causal chains.
definition: Dénomination de risques complexes utilisée dans les disciplines comme la géophysique ou la géographie physique, pour évoquer l'ensemble des relations physiques à l'origine des risques, qui se développent dans l'environnement naturel ainsi que leurs enchaînements causaux. @fr
in scheme: Thesaurus Multirisque FORESTT
preferred label: risques en interaction @fr
was quoted from: Adapted from Pescaroli et al. (2018) Understanding compound, interconnected, interacting, and cascading risks: a holistic framework. Risk Analysis, 2018, vol. 38, pp. 2245-2257. [En ligne]. Wiley. [Consulté le 07/04/2026]. <URL : https://doi.org/10.1111/risa.13128>
was quoted from: Adapté de Pescaroli et al. (2018) Understanding compound, interconnected, interacting, and cascading risks: a holistic framework. Risk Analysis, 2018, vol. 38, pp. 2245-2257. [En ligne]. Wiley. [Consulté le 07/04/2026]. <URL : https://doi.org/10.1111/risa.13128> @fr

asset at risk
has status: Published
type: Concept
broader: risk component
definition: Élément auquel les êtres humains attachent de la valeur et qui est exposé à un aléa. Cela peut être des personnes, des moyens de subsistance, des espèces ou des écosystèmes, des fonctions, des ressources ou services environnementaux, des éléments d’infrastructure ou de biens économiques, sociaux ou culturels. @fr
definition: Element to which human beings attach value and which is exposed to a hazard. This may include people, livelihoods, species or ecosystems, environmental functions, resources or services, infrastructure elements, or economic, social or cultural assets.
in scheme: Thesaurus Multirisque FORESTT
narrower: exposed asset
narrower: damage
preferred label: enjeu @fr
was quoted from: Adapté de GIEC (2018) Glossaire. [En ligne]. Genève, GIEC. [Consulté le 20/02/2026]. <URL : https://www.ipcc.ch/site/assets/uploads/sites/2/2019/10/SR15_Glossary_french.pdf>. @fr
was quoted from: Adapted from GIEC (2018) Glossaire. [En ligne]. Genève, GIEC. [Consulté le 20/02/2026]. <URL : https://www.ipcc.ch/site/assets/uploads/sites/2/2019/10/SR15_Glossary_french.pdf>.

environmental regulation applying to forestry work companies
has status: Published
type: Concept
broader: vulnerability of forestry work companies
definition: Vulnerability of forestry work companies related to environmental regulatory constraints.
definition: Vulnérabilité des entreprises de travaux forestiers liée aux contraintes réglementaires environnementales. @fr
in scheme: Thesaurus Multirisque FORESTT
preferred label: réglementation environnementale s'appliquant aux entreprises de travaux forestiers @fr
was quoted from: Groupe de travail « Thésaurus du multirisque en forêt » du projet X-RISKS du PEPR FORESTT (ANR-24-PEFO-0005). [En ligne]. <URL : https://www.pepr-forestt.fr/projets/pc-x-risks> @fr

flash flood
has status: Published
type: Concept
broader: torrential hazard
definition: Crue brutale, soudaine dues à des pluies orageuses très violentes et localisées se caractérisant par une montée des eaux très rapide. @fr
definition: Sudden, brutal flood caused by very violent and localised stormy rainfall, characterised by a very rapid rise in water levels.
in scheme: Thesaurus Multirisque FORESTT
preferred label: crue éclair @fr
was quoted from: Adapté de Aquagir. Crue éclair. Glossaire. [En ligne]. [Consulté le 03/06/2026]. <URL : https://aquagir.fr/tout-savoir-sur-leau/glossaire/crue-eclair/> @fr
was quoted from: Adapted from Aquagir. Crue éclair. Glossaire. [En ligne]. [Consulté le 03/06/2026]. <URL : https://aquagir.fr/tout-savoir-sur-leau/glossaire/crue-eclair/>

mixed avalanche
has status: Published
type: Concept
broader: avalanche
definition: Combinaison d’avalanches dense et en aérosol. @fr
definition: Combination of dense and powder avalanches.
in scheme: Thesaurus Multirisque FORESTT
preferred label: avalanche mixte @fr
was quoted from: Adapté de Géorisques.gouv.fr. Fiche risque [En ligne]. Paris, Ministère de la Transition écologique. [Consulté le 20/02/2026]. <URL : https://www.georisques.gouv.fr/minformer-sur-un-risque/avalanche>. @fr
was quoted from: Adapted from Géorisques.gouv.fr. Fiche risque [En ligne]. Paris, Ministère de la Transition écologique. [Consulté le 20/02/2026]. <URL : https://www.georisques.gouv.fr/minformer-sur-un-risque/avalanche>.

Thesaurus Multirisque FORESTT
subject: Ecosystem Research
type: Ontology
type: ConceptScheme
has top concept: risk to the wood sector
has top concept: risk to the forest
has top concept: multiple risks
has top concept: multi-risk
has top concept: risk
has top concept: emerging risk

risk prevention plan
has status: Published
type: Concept
broader: response to protect the wood sector
definition: Document de planification et de prévention dédié aux risques pour les enjeux de la filière forêt-bois. @fr
definition: Planning and prevention document dedicated to risks affecting forest-wood sector assets.
in scheme: Thesaurus Multirisque FORESTT
preferred label: plan de prévention des risques @fr
was quoted from: Adapté de Préfecture de l’Ain. Qu’est-ce qu’un Plan de Prévention des Risques (PPR) ? [En ligne]. [Consulté le 03/06/2026]. <URL : https://www.ain.gouv.fr/Actions-de-l-Etat/Environnement-risques-naturels-et-technologiques/Risques-majeurs-naturels-et-technologiques/4.-Plans-de-Prevention-des-Risques-dans-l-Ain-PPR/Plans-de-Prevention-des-risques-naturels/Qu-est-ce-qu-un-PPR> @fr
was quoted from: Adapted from Préfecture de l’Ain. Qu’est-ce qu’un Plan de Prévention des Risques (PPR) ? [En ligne]. [Consulté le 03/06/2026]. <URL : https://www.ain.gouv.fr/Actions-de-l-Etat/Environnement-risques-naturels-et-technologiques/Risques-majeurs-naturels-et-technologiques/4.-Plans-de-Prevention-des-Risques-dans-l-Ain-PPR/Plans-de-Prevention-des-risques-naturels/Qu-est-ce-qu-un-PPR>

anoxia
type: Concept
broader: near-surface water table depth
definition: Total absence of oxygen experienced by roots located in waterlogged soil.
definition: Absence totale d'oxygène subi par les racines situées en sol engorgé. @fr
in scheme: Thesaurus Multirisque FORESTT
preferred label: anoxie @fr
was quoted from: Adapted from Bréda (2023). Vulnérabilité, aléa, adaptation, résilience. [En ligne]. [Consulté le 20/02/2026]. <URL : https://revueforestierefrancaise.agroparistech.fr/article/view/7585 >.
was quoted from: Adapté de Bréda (2023). Vulnérabilité, aléa, adaptation, résilience. [En ligne]. [Consulté le 20/02/2026]. <URL : https://revueforestierefrancaise.agroparistech.fr/article/view/7585 >. @fr

hazard affecting the forest
has status: Published
type: Concept
broader: risk to the forest
definition: Éventualité d’une tendance ou d’un phénomène physique, naturel ou anthropique, susceptible d’entraîner des dégâts et des pertes touchant les écosystèmes forestiers et à leurs services. @fr
definition: The potential occurrence of a natural or human-induced physical trend or phenomenon likely to cause damage and loss to forest ecosystems and their services.
in scheme: Thesaurus Multirisque FORESTT
narrower: hazard characterisation
narrower: abiotic hazard
narrower: biotic hazard
preferred label: aléa qui impacte la forêt @fr
was quoted from: Adapté de GIEC (2018) Glossaire. Rapport spécial sur les conséquences d’un réchauffement planétaire de 1,5 °C. [En ligne]. Genève, GIEC. [Consulté le 20/02/2026]. <URL : https://www.ipcc.ch/site/assets/uploads/sites/2/2019/10/SR15_Glossary_french.pdf>. @fr
was quoted from: Adapted from GIEC (2018) Glossaire. Rapport spécial sur les conséquences d’un réchauffement planétaire de 1,5 °C. [En ligne]. Genève, GIEC. [Consulté le 20/02/2026]. <URL : https://www.ipcc.ch/site/assets/uploads/sites/2/2019/10/SR15_Glossary_french.pdf>.

defoliated tree
has status: Published
type: Concept
broader: damage characterisation
definition: Arbre présentant une quantité relative de feuilles ou d’aiguilles manquantes par rapport à un arbre de référence. @fr
definition: A tree with a relative shortage of leaves or needles compared to a reference tree.
in scheme: Thesaurus Multirisque FORESTT
preferred label: arbre défolié @fr
was quoted from: Adapté de Bussotti et al. (2024). Tree crown defoliation in forest monitoring: concepts, findings, and new perspectives for a physiological approach in the face of climate change. Forestry: An International Journal of Forest Research, 97(2), pp. 194-212. @fr
was quoted from: Adapted from Bussotti et al. (2024). Tree crown defoliation in forest monitoring: concepts, findings, and new perspectives for a physiological approach in the face of climate change. Forestry: An International Journal of Forest Research, 97(2), pp. 194-212.

abiotic hazard
has status: Published
type: Concept
broader: hazard affecting the forest
definition: Éventualité d’une tendance ou d’un phénomène physique susceptible d’entraîner des dégâts et des pertes touchant les écosystèmes forestiers et à leurs services. @fr
definition: The potential occurrence of a physical trend or phenomenon likely to cause damage and loss to forest ecosystems and their services.
in scheme: Thesaurus Multirisque FORESTT
narrower: natural hazard
narrower: anthropogenic hazard
preferred label: aléa abiotique @fr
was quoted from: Adapté de GIEC (2018) Glossaire. Rapport spécial sur les conséquences d’un réchauffement planétaire de 1,5 °C. [En ligne]. Genève, GIEC. [Consulté le 20/02/2026]. <URL : https://www.ipcc.ch/site/assets/uploads/sites/2/2019/10/SR15_Glossary_french.pdf>. @fr
was quoted from: Adapted from GIEC (2018) Glossaire. Rapport spécial sur les conséquences d’un réchauffement planétaire de 1,5 °C. [En ligne]. Genève, GIEC. [Consulté le 20/02/2026]. <URL : https://www.ipcc.ch/site/assets/uploads/sites/2/2019/10/SR15_Glossary_french.pdf>.

urban planning sector
has status: Published
type: Concept
broader: non-forest asset at risk
definition: Sector encompassing all policies, studies and actions aimed at organising, developing and planning territory (towns, urban areas, rural zones) in order to ensure a balanced, sustainable and functional living environment.
definition: Secteur qui regroupe l’ensemble des politiques, études et actions visant à organiser, aménager et développer le territoire (villes, agglomérations, zones rurales) afin d’assurer un cadre de vie équilibré, durable et fonctionnel. @fr
in scheme: Thesaurus Multirisque FORESTT
narrower: wildland-urban interface
narrower: downstream building
narrower: asset
preferred label: secteur de l'urbanisme @fr
was quoted from: Adapted from Géoconfluences. Glossaire (entrées relatives à l’urbanisme et à la planification urbaine). [En ligne]. ENS Lyon, glossaire en amélioration continue depuis plus de 20 ans (relectures 2020-2025). [Consulté le 25/03/2026]. <URL : https://geoconfluences.ens-lyon.fr/glossaire?searchTerm=urbanisme&subject=>
was quoted from: Adapté de Géoconfluences. Glossaire (entrées relatives à l’urbanisme et à la planification urbaine). [En ligne]. ENS Lyon, glossaire en amélioration continue depuis plus de 20 ans (relectures 2020-2025). [Consulté le 25/03/2026]. <URL : https://geoconfluences.ens-lyon.fr/glossaire?searchTerm=urbanisme&subject=> @fr

date of occurrence of drought
has status: Published
type: Concept
alternative label: saison d'occurrence de la sécheresse @fr
alternative label: season of occurrence of drought
broader: hazard characterisation
definition: Dates de début et fin d’un épisode de sécheresse. @fr
definition: Start and end dates of a drought episode.
in scheme: Thesaurus Multirisque FORESTT
preferred label: date d'occurrence de la sécheresse @fr
was quoted from: Adapté de INRAE (2023) Qu’est-ce que la sécheresse ? [En ligne]. [Consulté le 20/02/2026]. <URL : https://www.inrae.fr/actualites/quest-ce-que-secheresse>. @fr
was quoted from: Adapted from INRAE (2023) Qu’est-ce que la sécheresse ? [En ligne]. [Consulté le 20/02/2026]. <URL : https://www.inrae.fr/actualites/quest-ce-que-secheresse>.

foliage scorch
has status: Published
type: Concept
broader: damage characterisation
definition: Browning of needles or leaves in a tree's crown, caused by a rise in temperature to a lethal level during a fire.
definition: Brunissement des aiguilles ou des feuilles au niveau de la cime d'un arbre, provoqué par une élévation de la température à un niveau mortel lors d'un incendie. @fr
in scheme: Thesaurus Multirisque FORESTT
preferred label: roussissement foliaire @fr

twig and shoot blight fungus
has status: Published
type: Concept
broader: fungal phytopathogenic agent
definition: Organisme fongique provoquant des nécroses sur des rameaux et des extrémités. @fr
definition: Fungal organism causing necrosis on twigs and shoot tips.
in scheme: Thesaurus Multirisque FORESTT
preferred label: champignon responsable de brûlures des rameaux et des extrémités @fr
was quoted from: Adapté de EPHYTIA-INRAE. [En ligne]. [Consulté le 20/02/2026]. <URL : https://ephytia.inrae.fr/fr/C/18521/Forets-Champignons-et-autres-pathogenes>. @fr
was quoted from: Adapted from EPHYTIA-INRAE. [En ligne]. [Consulté le 20/02/2026]. <URL : https://ephytia.inrae.fr/fr/C/18521/Forets-Champignons-et-autres-pathogenes>.

plant contaminated by pine wood nematode
has status: Published
type: Concept
alternative label: arbre contaminé @fr
alternative label: contaminated tree
broader: sensitive host
definition: Plant carrying the pine wood nematode.
definition: Végétal portant le nématode du pin. @fr
in scheme: Thesaurus Multirisque FORESTT
preferred label: végétal contaminé par le nématode du pin @fr
was quoted from: Adapté de Plan national d'intervention sanitaire d'urgence relatif à Bursaphelenchus xylophilus (nématode du pin). [En ligne]. [Consulté le 20/02/2026]. <URL : https://info.agriculture.gouv.fr/boagri/instruction-2019-209>. @fr
was quoted from: Adapted from Plan national d'intervention sanitaire d'urgence relatif à Bursaphelenchus xylophilus (nématode du pin). [En ligne]. [Consulté le 20/02/2026]. <URL : https://info.agriculture.gouv.fr/boagri/instruction-2019-209>.

experienced hazard
has status: Published
type: Concept
broader: hazard characterisation
definition: Characteristic of an established fire directly impacting the considered location.
definition: Caractéristique d’un incendie établi impactant directement le lieu considéré. @fr
in scheme: Thesaurus Multirisque FORESTT
preferred label: aléa subi @fr

olfactory signals
has status: Published
type: Concept
broader: deterrent signals
definition: Dispositifs olfactifs repoussant les grands ongulés pour protéger les arbres. @fr
definition: Olfactory devices deterring large ungulates to protect trees.
in scheme: Thesaurus Multirisque FORESTT
preferred label: signaux olfactifs @fr
was quoted from: Groupe de travail « Thésaurus du multirisque en forêt » du projet X-RISKS du PEPR FORESTT (ANR-24-PEFO-0005). [En ligne]. <URL : https://www.pepr-forestt.fr/projets/pc-x-risks> @fr

non-commensurable risks
has status: Published
type: Concept
broader: multi-risk assessment method
definition: Risques qui ne peuvent être exprimés dans la même unité. @fr
definition: Risks that cannot be expressed in the same unit.
in scheme: Thesaurus Multirisque FORESTT
preferred label: risques non-commensurables @fr
was quoted from: Groupe de travail « Thésaurus du multirisque en forêt » du projet X-RISKS du PEPR FORESTT (ANR-24-PEFO-0005). [En ligne]. <URL : https://www.pepr-forestt.fr/projets/pc-x-risks> @fr

reservoir host
has status: Published
type: Concept
broader: host species
definition: Plante porteuse du pathogène qui ne montre aucun symptôme et qui assure la persistance et la diffusion du microbe dans l’environnement. @fr
definition: Plant carrying the pathogen that shows no symptoms and ensures the persistence and spread of the microbe in the environment.
in scheme: Thesaurus Multirisque FORESTT
preferred label: hôte réservoir @fr
was quoted from: Adapté de Cours EM1 N°5 - Hôtes et cycles parasitaires. [En ligne]. Présentation sur Scribd, ajoutée par Idrissou Fmsb. [Consulté le 25/03/2026]. <URL : https://fr.scribd.com/presentation/162172856/Cours-EM1-N-5-Hote-RV-Cycles> @fr
was quoted from: Adapted from Cours EM1 N°5 - Hôtes et cycles parasitaires. [En ligne]. Présentation sur Scribd, ajoutée par Idrissou Fmsb. [Consulté le 25/03/2026]. <URL : https://fr.scribd.com/presentation/162172856/Cours-EM1-N-5-Hote-RV-Cycles>

loss of emblematic genetic resources
has status: Published
type: Concept
broader: loss of cultural ecosystem service
definition: Perte d’espèces ou variétés forestières emblématiques. @fr
definition: Loss of emblematic forest species or varieties.
in scheme: Thesaurus Multirisque FORESTT
preferred label: perte de ressources génétiques emblématiques @fr
was quoted from: Adapté de Bijlsma & Loeschcke (2011) Genetic erosion impedes adaptive responses to stressful environments. Evolutionary Applications, 2012, vol. 5, n° 2, pp. 117-129. [En ligne]. Wiley Online Library. [Consulté le 07/04/2026]. <URL : https://onlinelibrary.wiley.com/doi/10.1111/j.1752-4571.2011.00214.x> @fr
was quoted from: Adapted from Bijlsma & Loeschcke (2011) Genetic erosion impedes adaptive responses to stressful environments. Evolutionary Applications, 2012, vol. 5, n° 2, pp. 117-129. [En ligne]. Wiley Online Library. [Consulté le 07/04/2026]. <URL : https://onlinelibrary.wiley.com/doi/10.1111/j.1752-4571.2011.00214.x>

frost intensity
has status: Published
type: Concept
broader: hazard characterisation
definition: Niveau minimal de température atteint pendant l’épisode de gel. @fr
definition: Minimum temperature level reached during the frost episode.
in scheme: Thesaurus Multirisque FORESTT
preferred label: intensité du gel @fr
was quoted from: Adapted from EPHYTIA-INRAE. [En ligne]. [Consulté le 20/02/2026]. <URL : https://ephytia.inrae.fr/fr/C/18542/Forets-Froids-gelees>.
was quoted from: Adapté de EPHYTIA-INRAE. [En ligne]. [Consulté le 20/02/2026]. <URL : https://ephytia.inrae.fr/fr/C/18542/Forets-Froids-gelees>. @fr

structural heterogeneity
has status: Published
type: Concept
broader: stand structure
definition: Hétérogénité dans l'abondance, dans les caractéristiques et dans l’agencement spatial des composantes végétales vivantes ou mortes d’un peuplement. @fr
definition: Heterogeneity in the abundance, characteristics and spatial arrangement of the living or dead plant components of a stand.
in scheme: Thesaurus Multirisque FORESTT
narrower: discontinuous canopy
narrower: landscape fragmentation
narrower: edge shape
narrower: even-aged stand
narrower: homogeneous diameter structure
preferred label: hétérogénéité structurale @fr
was quoted from: Adapté de Angers et al. Complexité structurale des peuplements feuillus : Caractérisation, influences de l’aménagement et avenues pour la restauration. 2014. [En ligne]. Gouvernement du Québec, Ministère des Forêts, de la Faune et des Parcs. [Consulté le 07/04/2026]. <URL : https://diffusion.mern.gouv.qc.ca/public/biblio/mono/2015/01/1162392.pdf> @fr
was quoted from: Adapted from Angers et al. Complexité structurale des peuplements feuillus : Caractérisation, influences de l’aménagement et avenues pour la restauration. 2014. [En ligne]. Gouvernement du Québec, Ministère des Forêts, de la Faune et des Parcs. [Consulté le 07/04/2026]. <URL : https://diffusion.mern.gouv.qc.ca/public/biblio/mono/2015/01/1162392.pdf>

prevalence
has status: Published
type: Concept
broader: hazard characterisation
definition: Taux de présence d’une maladie dans une population d’arbres. @fr
definition: Rate of presence of a disease in a tree population.
in scheme: Thesaurus Multirisque FORESTT
narrower: pathogen prevalence
preferred label: prévalence @fr
was quoted from: Adapté de Géoconfluences. Prévalence. [En ligne]. [Consulté le 13/03/2026]. <URL : https://geoconfluences.ens-lyon.fr/glossaire/prevalence> @fr
was quoted from: Adapted from Géoconfluences. Prévalence. [En ligne]. [Consulté le 13/03/2026]. <URL : https://geoconfluences.ens-lyon.fr/glossaire/prevalence>

adjust stand composition during interventions
has status: Published
type: Concept
broader: choice of species
definition: Ajuster la composition en espèces des peuplements lors des travaux sylvicole, en réalisant par exemple des éclaircies sélectives. @fr
definition: Adjust the species composition of stands during silvicultural operations, for example through selective thinning.
in scheme: Thesaurus Multirisque FORESTT
preferred label: travailler la composition des peuplements lors des interventions @fr
was quoted from: Groupe de travail « Thésaurus du multirisque en forêt » du projet X-RISKS du PEPR FORESTT (ANR-24-PEFO-0005). [En ligne]. <URL : https://www.pepr-forestt.fr/projets/pc-x-risks> @fr

intensive silviculture
has status: Published
type: Concept
broader: anthropogenic hazard
definition: Ensemble des pratiques sylvicoles dans les peuplements établis afin d’en optimiser la valeur et le rendement. @fr
definition: All silvicultural practices in established stands aimed at optimising their value and yield.
in scheme: Thesaurus Multirisque FORESTT
narrower: mechanisation of forestry work
narrower: forest overexploitation
preferred label: sylviculture intensive @fr
was quoted from: Adapté de RNCan - Service canadien des forêts. Glossaire forestier : Sylviculture intensive. [En ligne]. 2019. [Consulté le 25/03/2026]. <URL : https://scf.rncan.gc.ca/termes/vue/717> @fr
was quoted from: Adapted from RNCan - Service canadien des forêts. Glossaire forestier : Sylviculture intensive. [En ligne]. 2019. [Consulté le 25/03/2026]. <URL : https://scf.rncan.gc.ca/termes/vue/717>

environmental asset at risk
has status: Published
type: Concept
alternative label: ecological asset
alternative label: enjeu écologique @fr
broader: forest asset at risk
definition: Espèce ou écosystème, fonction, ressource ou service environnemental, exposé à un aléa et susceptible de subir des dommages. @fr
definition: Species or ecosystem, environmental function, resource or service, exposed to a hazard and likely to suffer damage.
in scheme: Thesaurus Multirisque FORESTT
narrower: forest ecosystem service
preferred label: enjeu environnemental @fr
was quoted from: Adapté de GIEC (2018) Glossaire. [En ligne]. Genève, GIEC. [Consulté le 20/02/2026]. <URL : https://www.ipcc.ch/site/assets/uploads/sites/2/2019/10/SR15_Glossary_french.pdf>. @fr
was quoted from: Adapted from GIEC (2018) Glossaire. [En ligne]. Genève, GIEC. [Consulté le 20/02/2026]. <URL : https://www.ipcc.ch/site/assets/uploads/sites/2/2019/10/SR15_Glossary_french.pdf>.

forest asset at risk
has status: Published
type: Concept
broader: risk to the forest
definition: Tout ou partie d'un écosystème forestier, de ses fonctions ou de ses services exposé à un aléa et susceptible de subir des dommages. @fr
definition: All or part of a forest ecosystem, its functions or its services, exposed to a hazard and likely to suffer damage.
in scheme: Thesaurus Multirisque FORESTT
narrower: environmental asset at risk
preferred label: enjeu forestier @fr
was quoted from: Adapté de GIEC (2018) Glossaire. [En ligne]. Genève, GIEC. [Consulté le 20/02/2026]. <URL : https://www.ipcc.ch/site/assets/uploads/sites/2/2019/10/SR15_Glossary_french.pdf>. @fr
was quoted from: Adapted from GIEC (2018) Glossaire. [En ligne]. Genève, GIEC. [Consulté le 20/02/2026]. <URL : https://www.ipcc.ch/site/assets/uploads/sites/2/2019/10/SR15_Glossary_french.pdf>.

emerging risk
has status: Published
type: Concept
definition: New risk resulting from the interaction of phenomena within a complex system.
definition: Risque nouveau résultant de l'interaction de phénomènes au sein d'un système complexe. @fr
in scheme: Thesaurus Multirisque FORESTT
narrower: systemic risk
narrower: systemic failure
narrower: systemic vulnerability
preferred label: risque émergent @fr
top concept of: Thesaurus Multirisque FORESTT
was quoted from: Adapted from Simpson et al. (2023) Adaptation to compound climate risks: A systematic global stocktake. iScience, 2023, vol. 26, 105926. [En ligne]. ScienceDirect. [Consulté le 07/04/2026]. <URL : https://doi.org/10.1016/j.isci.2023.105926>
was quoted from: Adapté de Simpson et al. (2023) Adaptation to compound climate risks: A systematic global stocktake. iScience, 2023, vol. 26, 105926. [En ligne]. ScienceDirect. [Consulté le 07/04/2026]. <URL : https://doi.org/10.1016/j.isci.2023.105926> @fr

cascade effect
has status: Published
type: Concept
alternative label: risk cascade
alternative label: risques en cascade @fr
alternative label: effet domino @fr
alternative label: effet de ricochet @fr
alternative label: réaction en chaîne @fr
alternative label: relation de cause à effet @fr
alternative label: knock-on effect
alternative label: cascade de risques @fr
alternative label: cascading risks
alternative label: domino effect
alternative label: ripple effect
alternative label: chain reaction
alternative label: cause-and-effect relationship
broader: sequential risks
definition: Succession d’événements catastrophiques déclenchés par un événement initiateur. @fr
definition: Succession of catastrophic events triggered by an initiating event.
in scheme: Thesaurus Multirisque FORESTT
narrower: combined impacts
narrower: feedback cascade
narrower: natech
preferred label: effet cascade @fr
was quoted from: Adapté de Curt (2020) Multirisque : quelles orientations de recherche dans les travaux récents ? [En ligne]. [Consulté le 20/02/2026]. <URL : https://hal.science/hal-03462813/document>. @fr
was quoted from: Adapted from Curt (2020) Multirisque : quelles orientations de recherche dans les travaux récents ? [En ligne]. [Consulté le 20/02/2026]. <URL : https://hal.science/hal-03462813/document>.

anthropogenic hazard
has status: Published
type: Concept
broader: abiotic hazard
definition: Éventualité d’une tendance ou d’un phénomène anthropique, susceptible d’entraîner des dégâts et des pertes touchant les écosystèmes forestiers et à leurs services. @fr
definition: The potential occurrence of a human-induced trend or phenomenon likely to cause damage and loss to forest ecosystems and their services.
in scheme: Thesaurus Multirisque FORESTT
narrower: intensive silviculture
narrower: pollution
preferred label: aléa anthropique @fr
was quoted from: Adapté de GIEC (2018) Glossaire. Rapport spécial sur les conséquences d’un réchauffement planétaire de 1,5 °C. [En ligne]. Genève, GIEC. [Consulté le 20/02/2026]. <URL : https://www.ipcc.ch/site/assets/uploads/sites/2/2019/10/SR15_Glossary_french.pdf>. @fr
was quoted from: Adapted from GIEC (2018) Glossaire. Rapport spécial sur les conséquences d’un réchauffement planétaire de 1,5 °C. [En ligne]. Genève, GIEC. [Consulté le 20/02/2026]. <URL : https://www.ipcc.ch/site/assets/uploads/sites/2/2019/10/SR15_Glossary_french.pdf>.

varietal mixture
has status: Published
type: Concept
alternative label: mélange intraspécifique @fr
alternative label: mélange de matériel forestier reproduction (mfr) @fr
broader: genotype mixing through planting
definition: Mixture of different FRM (Forest Reproductive Material) of the same species to increase the genetic diversity of the stand.
definition: Mélange de différents MFR (Matériel Forestier de Reproduction) de la même espèce afin d'augmenter la diversité génétique du peuplement. @fr
in scheme: Thesaurus Multirisque FORESTT
preferred label: mélange variétal @fr
was quoted from: Groupe de travail « Thésaurus du multirisque en forêt » du projet X-RISKS du PEPR FORESTT (ANR-24-PEFO-0005). [En ligne]. <URL : https://www.pepr-forestt.fr/projets/pc-x-risks> @fr

protection forest
has status: Published
type: Concept
broader: governance measure
definition: Forêt dont la conservation est reconnue nécessaire au maintien des terres sur les montagnes et sur les pentes, à la défense contre les avalanches, les érosions et les envahissements des eaux et des sables. @fr
definition: Forest whose conservation is recognised as necessary for maintaining land on mountains and slopes, and for defence against avalanches, erosion and the encroachment of water and sand.
in scheme: Thesaurus Multirisque FORESTT
preferred label: forêt de protection @fr
was quoted from: Adapté de Moos et al. (2018). Ecosystem-based disaster risk reduction in mountains. Earth-Science Reviews, 177, pp. 497-513. [En ligne]. [Consulté le 03/06/2026]. <URL : https://doi.org/10.1016/j.earscirev.2017.12.011> @fr
was quoted from: Adapted from Moos et al. (2018). Ecosystem-based disaster risk reduction in mountains. Earth-Science Reviews, 177, pp. 497-513. [En ligne]. [Consulté le 03/06/2026]. <URL : https://doi.org/10.1016/j.earscirev.2017.12.011>

prevention through genetics
has status: Published
type: Concept
broader: preventive silviculture
definition: Application des connaissances en génétique forestière pour atténuer les risques en forêt. @fr
definition: Application of forest genetics knowledge to mitigate forest risks.
in scheme: Thesaurus Multirisque FORESTT
narrower: genotype mixing
narrower: genetic selection for resistance
preferred label: prévention par la génétique @fr
was quoted from: Groupe de travail « Thésaurus du multirisque en forêt » du projet X-RISKS du PEPR FORESTT (ANR-24-PEFO-0005). [En ligne]. <URL : https://www.pepr-forestt.fr/projets/pc-x-risks> @fr

crisis management plan
has status: Published
type: Concept
broader: response to protect the wood sector
definition: Protocole officiel décrivant les mesures à prendre pour minimiser l'impact d'une crise en forêt sur la filière forêt-bois, en assurant la continuité des activités critiques et kla sécurité des employés. @fr
definition: Official protocol describing the measures to be taken to minimise the impact of a forest crisis on the forest-wood sector, ensuring the continuity of critical activities and employee safety.
in scheme: Thesaurus Multirisque FORESTT
narrower: emergency plan
narrower: requisition of personnel and equipment
preferred label: plan de gestion de crise @fr
was quoted from: Adapté de DREAL Normandie. Qu’est-ce que la gestion de crise ? [En ligne]. [Consulté le 03/06/2026]. <URL : https://www.normandie.developpement-durable.gouv.fr/qu-est-ce-que-la-gestion-de-crise-a6065.html?lang=fr> @fr
was quoted from: Adapted from DREAL Normandie. Qu’est-ce que la gestion de crise ? [En ligne]. [Consulté le 03/06/2026]. <URL : https://www.normandie.developpement-durable.gouv.fr/qu-est-ce-que-la-gestion-de-crise-a6065.html?lang=fr>

mechanical destruction
has status: Published
type: Concept
broader: damage characterisation
definition: Dommages mécaniques des grands ongulés sur les arbres. @fr
definition: Mechanical damage caused to trees by large ungulates.
in scheme: Thesaurus Multirisque FORESTT
narrower: uprooting of seedlings/plants
narrower: bark stripping
narrower: buck rubbing
narrower: trampling
narrower: browsing
preferred label: destruction mécanique @fr
was quoted from: Groupe de travail « Thésaurus du multirisque en forêt » du projet X-RISKS du PEPR FORESTT (ANR-24-PEFO-0005). [En ligne]. <URL : https://www.pepr-forestt.fr/projets/pc-x-risks> @fr

vulnerability of silvicultural management models
has status: Published
type: Concept
broader: vulnerability of the wood sector
definition: Vulnerability of the forest-wood sector related to the type of silvicultural management model.
definition: Vulnérabilité de la filière forêt-bois liée au type de modèle de gestion sylvicole. @fr
in scheme: Thesaurus Multirisque FORESTT
narrower: vulnerability of extensive silvicultural management models
narrower: vulnerability of intensive silvicultural management models
preferred label: vulnérabilité des modèles de gestion sylvicole @fr
was quoted from: Groupe de travail « Thésaurus du multirisque en forêt » du projet X-RISKS du PEPR FORESTT (ANR-24-PEFO-0005). [En ligne]. <URL : https://www.pepr-forestt.fr/projets/pc-x-risks> @fr

plant susceptible to pine wood nematode
has status: Published
type: Concept
broader: sensitive host
definition: Species particularly vulnerable to the pine wood nematode.
definition: Espèce particulièrement vulnérable au nématode du pin. @fr
in scheme: Thesaurus Multirisque FORESTT
preferred label: végétal sensible au nématode du pin @fr
was quoted from: Adapté de Plan national d'intervention sanitaire d'urgence relatif à Bursaphelenchus xylophilus (nématode du pin). [En ligne]. [Consulté le 20/02/2026]. <URL : https://info.agriculture.gouv.fr/boagri/instruction-2019-209>. @fr
was quoted from: Adapted from Plan national d'intervention sanitaire d'urgence relatif à Bursaphelenchus xylophilus (nématode du pin). [En ligne]. [Consulté le 20/02/2026]. <URL : https://info.agriculture.gouv.fr/boagri/instruction-2019-209>.

vector insect
has status: Published
type: Concept
broader: pest insect
definition: Insecte capable de transmettre un virus ou un nématode à une plante-hôte. @fr
definition: Insect capable of transmitting a virus or nematode to a host plant.
in scheme: Thesaurus Multirisque FORESTT
narrower: pine wood nematode vector insect
preferred label: insecte vecteur @fr
was quoted from: Adapté de EPHYTIA-INRAE. Vecteur virus. [En ligne]. [Consulté le 20/02/2026]. <URL : https://ephytia.inrae.fr/fr/C/16230/Hypp-encyclopedie-en-protection-des-plantes-vecteur-virus>. @fr
was quoted from: Adapted from EPHYTIA-INRAE. Vecteur virus. [En ligne]. [Consulté le 20/02/2026]. <URL : https://ephytia.inrae.fr/fr/C/16230/Hypp-encyclopedie-en-protection-des-plantes-vecteur-virus>.

political hazard
has status: Published
type: Concept
broader: hazard threatening the wood industry
definition: Instability of public policies and regulations creating uncertainty for forest-wood sector actors and hindering investment.
definition: Instabilité des politiques publiques et des réglementations créant de l'incertitude pour les acteurs de la filière forêt-bois et freinant l'investissement. @fr
in scheme: Thesaurus Multirisque FORESTT
narrower: change in legislation
preferred label: aléa politique @fr
was quoted from: Adapted from Eggoh & Kobbi (2021) L'instabilité politique et ses déterminants : un réexamen empirique. Revue française d'économie, 2021, vol. 36, n° 4, pp. 219-263. [En ligne]. Cairn.info. [Consulté le 07/04/2026]. <URL : https://shs.cairn.info/revue-francaise-d-economie-2021-4-page-219?lang=fr>
was quoted from: Adapté de Eggoh & Kobbi (2021) L'instabilité politique et ses déterminants : un réexamen empirique. Revue française d'économie, 2021, vol. 36, n° 4, pp. 219-263. [En ligne]. Cairn.info. [Consulté le 07/04/2026]. <URL : https://shs.cairn.info/revue-francaise-d-economie-2021-4-page-219?lang=fr> @fr

critical wind speed
type: Concept
broader: damage characterisation
definition: Estimate of the gust speed threshold beyond which a tree or a homogeneous stand is damaged. A distinction is generally made between a critical speed leading to stem breakage and one leading to uprooting (windthrow); the probability that the lower speed will occur allows the risk to be quantified. The speed estimate results from calculating the mechanical balance between the action of the wind and the resistance of the trunk, or the anchorage of the tree.
definition: Estimation du seuil de vitesse de rafales au-delà duquel un arbre ou un peuplement homogène est endommagé. On distingue en général une vitesse critique conduisant à la casse (volis) et au déracinement (chablis), la probabilité que la vitesse la plus faible advienne permet de quantifier le risque. L'estimation de la vitesse résulte du calcul de l'équilibre mécanique entre l'action du vent et la résistance du tronc, ou de l'ancrage de l'arbre. @fr
in scheme: Thesaurus Multirisque FORESTT
preferred label: vitesse critique du vent @fr
was quoted from: Groupe de travail « Thésaurus du multirisque en forêt » du projet X-RISKS du PEPR FORESTT (ANR-24-PEFO-0005). [En ligne]. <URL : https://www.pepr-forestt.fr/projets/pc-x-risks> @fr

wood shortage
has status: Published
type: Concept
broader: pressure on the wood resource
definition: Manque structurel de bois approvisionnable. @fr
definition: Structural lack of available wood supply.
in scheme: Thesaurus Multirisque FORESTT
preferred label: pénurie du bois @fr
was quoted from: Adapté de Wood and Panel. L'Europe est confrontée à une pénurie croissante de bois : un défi majeur pour la transition écologique et l'économie circulaire. [En ligne]. Wood and Panel. [Consulté le 07/04/2026]. <URL : https://www.woodandpanel.fr/nouvelles-du-bois/article/L%27Europe-est-confront%C3%A9e-%C3%A0-une-p%C3%A9nurie-croissante-de-bois--un-d%C3%A9fi-majeur-pour-la-transition-%C3%A9cologique-et-l%27%C3%A9conomie-circulaire./> @fr
was quoted from: Adapted from Wood and Panel. L'Europe est confrontée à une pénurie croissante de bois : un défi majeur pour la transition écologique et l'économie circulaire. [En ligne]. Wood and Panel. [Consulté le 07/04/2026]. <URL : https://www.woodandpanel.fr/nouvelles-du-bois/article/L%27Europe-est-confront%C3%A9e-%C3%A0-une-p%C3%A9nurie-croissante-de-bois--un-d%C3%A9fi-majeur-pour-la-transition-%C3%A9cologique-et-l%27%C3%A9conomie-circulaire./>

epidemic
has status: Published
type: Concept
alternative label: epidemic regime/phase
alternative label: variation d’abondance @fr
alternative label: régime/phase épidémique @fr
alternative label: pandémie @fr
alternative label: abundance variation
alternative label: pandemic
broader: hazard characterisation
definition: Extension d’une maladie à un grand nombre d’individus de la population hôte mais qui reste localisée géographiquement et sur une courte période de temps. @fr
definition: Spread of a disease to a large number of individuals in the host population, but which remains geographically localised and confined to a short period of time.
in scheme: Thesaurus Multirisque FORESTT
preferred label: épidémie @fr
was quoted from: Adapted from Robin et al. (2018) Émergences de maladies chez les arbres forestiers : Définitions, concepts et recommandations. Revue forestière française, 2018, vol. 70, n°6, pp. 569-577. [En ligne]. HAL open science. [Consulté le 13/03/2026]. <URL : https://hal.science/hal-03447472/document>
was quoted from: Adapté de Robin et al. (2018) Émergences de maladies chez les arbres forestiers : Définitions, concepts et recommandations. Revue forestière française, 2018, vol. 70, n°6, pp. 569-577. [En ligne]. HAL open science. [Consulté le 13/03/2026]. <URL : https://hal.science/hal-03447472/document> @fr

provision of alternative food resources
has status: Published
type: Concept
alternative label: leaving harvest residues
alternative label: laisser les rémanents d’exploitation @fr
broader: open habitat management
definition: Agencement des zones non arborées et des cloisonnements sylvicoles au voisinage des jeunes plantations pour détournée les grands ongulés sur une ressource alimentaire alternative. @fr
definition: Arrangement of unforested areas and silvicultural compartmentalisation in the vicinity of young plantations to divert large ungulates towards an alternative food resource.
in scheme: Thesaurus Multirisque FORESTT
preferred label: mise à disposition de ressources alimentaires alternatives @fr
was quoted from: Adapté de Marell et al. (2022) Risques environnementaux et ongulés sauvages : un sujet à multiples facettes. [Rapport de recherche] INRAE UR EFNO; INRAE UR CEFS. 2022, pp.44. [En ligne]. [Consulté le 25/03/2026]. <URL: https://hal.inrae.fr/hal-03630674>. @fr
was quoted from: Adapted from Marell et al. (2022) Risques environnementaux et ongulés sauvages : un sujet à multiples facettes. [Rapport de recherche] INRAE UR EFNO; INRAE UR CEFS. 2022, pp.44. [En ligne]. [Consulté le 25/03/2026]. <URL: https://hal.inrae.fr/hal-03630674>.

high fuel biomass
has status: Published
type: Concept
broader: high combustibility
definition: Large quantity of biomass available to burn.
definition: Quantité importante de biomasse disponible pour brûler. @fr
in scheme: Thesaurus Multirisque FORESTT
preferred label: forte biomasse combustible @fr
was quoted from: Adapté de Revertegat et al. (2025) Synthèse sur la vulnérabilité des peuplements forestiers au feu. Rapport final du projet AFORCE VULNEFEU (Vulnefeu04). [En ligne]. Réseau AFORCE, 2025. [Consulté le 25/03/2026]. <URL : https://www.reseau-aforce.fr/sites/reseau-aforce/files/2025-07/Rapport-Vulnefeu04-compressed.pdf @fr
was quoted from: Adapted from Revertegat et al. (2025) Synthèse sur la vulnérabilité des peuplements forestiers au feu. Rapport final du projet AFORCE VULNEFEU (Vulnefeu04). [En ligne]. Réseau AFORCE, 2025. [Consulté le 25/03/2026]. <URL : https://www.reseau-aforce.fr/sites/reseau-aforce/files/2025-07/Rapport-Vulnefeu04-compressed.pdf

adapt forest infrastructure
has status: Published
type: Concept
broader: prevention
definition: Ajuster les équipements de prévention et de lutte en forêt à l'évolution du risque. @fr
definition: Adjust prevention and firefighting equipment in the forest to changes in risk.
in scheme: Thesaurus Multirisque FORESTT
narrower: adapt the access network
narrower: access road network
narrower: water point network
narrower: forest signage
preferred label: adapter les infrastructures forestières @fr
was quoted from: Adapted from Rigolot (2002) Du plan départemental à la coupure de combustible. Guide méthodologique et pratique. Réseau Coupures de combustible n°6, 2002. [En ligne]. Éditions de la Cardère. [Consulté le 01/04/2026]. <URL : https://cardere.fr/doc/RCC6.pdf>
was quoted from: Adapté de Rigolot (2002) Du plan départemental à la coupure de combustible. Guide méthodologique et pratique. Réseau Coupures de combustible n°6, 2002. [En ligne]. Éditions de la Cardère. [Consulté le 01/04/2026]. <URL : https://cardere.fr/doc/RCC6.pdf> @fr

multi-vulnerability
has status: Published
type: Concept
broader: multi-hazard/vulnerability
definition: Soit une diversité de cibles sensibles exposées pouvant présenter des degrés de vulnérabilité variables face aux différents aléas, soit des vulnérabilités dépendantes du temps, dans lesquelles la vulnérabilité d'une catégorie spécifique d'éléments exposés peut évoluer au fil du temps sous l'effet de différents facteurs @fr
definition: Either a diversity of exposed sensitive targets that may show varying degrees of vulnerability to different hazards, or time-dependent vulnerabilities, in which the vulnerability of a specific category of exposed elements may change over time under the effect of different factors.
in scheme: Thesaurus Multirisque FORESTT
preferred label: multi-vulnérabilité @fr
was quoted from: Adapté de Marzocchi et al. (2012) Basic principles of multi-risk assessment: a case study in Italy. Natural Hazards, 2012, vol. 62, pp. 551-573. [En ligne]. Springer. [Consulté le 07/04/2026]. <URL : https://doi.org/10.1007/s11069-012-0092-x> @fr
was quoted from: Adapted from Marzocchi et al. (2012) Basic principles of multi-risk assessment: a case study in Italy. Natural Hazards, 2012, vol. 62, pp. 551-573. [En ligne]. Springer. [Consulté le 07/04/2026]. <URL : https://doi.org/10.1007/s11069-012-0092-x>

DEFI scheme
has status: Published
type: Concept
broader: structural assistance
definition: Dispositif d'encouragement fiscal à l'investissement en forêt (DEFI), un crédit d’impôt pour les contribuables réalisant des investissements forestiers (acquisitions, travaux, cotisations aux assurances). @fr
definition: Tax incentive scheme for forest investment (DEFI), a tax credit for taxpayers making forest investments (acquisitions, works, insurance contributions).
in scheme: Thesaurus Multirisque FORESTT
narrower: DEFI works
narrower: DEFI insurance
preferred label: dispositif DEFI @fr
was quoted from: Adapté de DRAAF Grand Est. DEFI : Le dispositif d’encouragement fiscal à l’investissement en forêt. [En ligne]. Ministère de l’Agriculture et de la Souveraineté alimentaire. [Consulté le 07/04/2026]. <URL : https://draaf.grand-est.agriculture.gouv.fr/dispositif-d-encouragement-fiscal-a-l-investissement-en-foret-defi-a79.html> @fr
was quoted from: Adapted from DRAAF Grand Est. DEFI : Le dispositif d’encouragement fiscal à l’investissement en forêt. [En ligne]. Ministère de l’Agriculture et de la Souveraineté alimentaire. [Consulté le 07/04/2026]. <URL : https://draaf.grand-est.agriculture.gouv.fr/dispositif-d-encouragement-fiscal-a-l-investissement-en-foret-defi-a79.html>

fire cause and circumstance investigation (RCCI)
has status: Published
type: Concept
broader: fire outbreak surveillance
definition: Investigation into the origin of forest fires carried out jointly by firefighter representatives, gendarmerie experts and foresters.
definition: Enquête sur l'origine des incendies de forêt réalisée conjointement par des représentants des pompiers, d'experts gendarmes et de forestiers. @fr
in scheme: Thesaurus Multirisque FORESTT
preferred label: recherche des causes et des circonstances d’incendies (RCCI) @fr
was quoted from: Adapted from ENSOSP. Recherche des causes et circonstances de l’incendie (RCCI). [En ligne]. [Consulté le 25/03/2026]. <URL : https://pnrs.ensosp.fr/Default/doc/SYRACUSE/97025/la-recherche-des-causes-et-des-circonstances-de-l-incendie-rcci-rcci>
was quoted from: Adapté de ENSOSP. Recherche des causes et circonstances de l’incendie (RCCI). [En ligne]. [Consulté le 25/03/2026]. <URL : https://pnrs.ensosp.fr/Default/doc/SYRACUSE/97025/la-recherche-des-causes-et-des-circonstances-de-l-incendie-rcci-rcci> @fr

avalanche
has status: Published
type: Concept
broader: gravitational hazard
definition: Écoulement gravitaire rapide de neige à des vitesses dépassant le mètre par seconde. @fr
definition: Rapid gravitational flow of snow at speeds exceeding one metre per second.
in scheme: Thesaurus Multirisque FORESTT
narrower: dense avalanche
narrower: mixed avalanche
narrower: powder avalanche
was quoted from: Adapté de Géorisques.gouv.fr. Glossaire. [En ligne]. Paris, Ministère de la Transition écologique. [Consulté le 20/02/2026]. <URL : https://www.georisques.gouv.fr/glossaire/avalanche>. @fr
was quoted from: Adapted from Géorisques.gouv.fr. Glossaire. [En ligne]. Paris, Ministère de la Transition écologique. [Consulté le 20/02/2026]. <URL : https://www.georisques.gouv.fr/glossaire/avalanche>.

storm
has status: Published
type: Concept
alternative label: cyclone
broader: violent wind
definition: Dépression générant des rafales de vent supérieures à 90 km/h sur terre en France. @fr
definition: Depression generating wind gusts exceeding 90 km/h over land in France.
in scheme: Thesaurus Multirisque FORESTT
preferred label: tempête @fr
was quoted from: Adapted from Météo France. Dangers météorologiques - vent. [En ligne]. Toulouse, Météo France. [Consulté le 20/02/2026]. <URL : https://vigilance.meteofrance.fr/fr/dangers-meteorologiques-vent>.
was quoted from: Adapté de Météo France. Dangers météorologiques - vent. [En ligne]. Toulouse, Météo France. [Consulté le 20/02/2026]. <URL : https://vigilance.meteofrance.fr/fr/dangers-meteorologiques-vent>. @fr

access route
type: Concept
broader: transport sector
definition: Infrastructure exposed to forest hazards when it crosses the forest (road, railway, cycle path, hiking trail, ...). It can also be a cause of forest fire.
definition: Infrastructure exposée aux aléas de la forêt lorsqu'elle la traverse (route, chemin de fer, piste cyclable, chemin de randonnée, ...). Elle peut être aussi une cause d'incendie en forêt. @fr
in scheme: Thesaurus Multirisque FORESTT
preferred label: voie d'acheminement @fr
was quoted from: Groupe de travail « Thésaurus du multirisque en forêt » du projet X-RISKS du PEPR FORESTT (ANR-24-PEFO-0005). [En ligne]. <URL : https://www.pepr-forestt.fr/projets/pc-x-risks> @fr

low wound-healing capacity
has status: Published
type: Concept
broader: individual factor
definition: Low capacity of a tree to close wounds.
definition: Faible capacité d'un arbre à refermer les plaies. @fr
in scheme: Thesaurus Multirisque FORESTT
preferred label: faible capacité de cicatrisation @fr
was quoted from: Groupe de travail « Thésaurus du multirisque en forêt » du projet X-RISKS du PEPR FORESTT (ANR-24-PEFO-0005). [En ligne]. <URL : https://www.pepr-forestt.fr/projets/pc-x-risks> @fr

secondary pest
has status: Published
type: Concept
alternative label: ravageur de faiblesse @fr
alternative label: parasite de faiblesse @fr
alternative label: weakness pest
alternative label: weakness parasite
broader: hazard characterisation
definition: Agent pathogène attaquant des arbres déjà affaiblis, dépérissants ou chablis. @fr
definition: Pathogenic agent attacking trees already weakened, declining, or windthrown.
in scheme: Thesaurus Multirisque FORESTT
preferred label: ravageur secondaire @fr
was quoted from: Adapté de e-phytia. Forêts - Scolyte de Vorontzow. Encyclopédie en protection des plantes. [En ligne]. INRAE, Département de la Santé des Forêts. [Consulté le 25/03/2026]. <URL : https://ephytia.inra.fr/fr/C/26471/Forets-Scolyte-de-Vorontzow> @fr
was quoted from: Adapted from e-phytia. Forêts - Scolyte de Vorontzow. Encyclopédie en protection des plantes. [En ligne]. INRAE, Département de la Santé des Forêts. [Consulté le 25/03/2026]. <URL : https://ephytia.inra.fr/fr/C/26471/Forets-Scolyte-de-Vorontzow>

increase the company's cash flow
has status: Published
type: Concept
broader: response to protect the company
definition: Mesures de soutien à la trésorerie de l'entreprise forestière par des dispositifs fiscaux et d'aides à l'installation pour améliorer leur trésorerie, ainsi que par des prêts garantis par l'État pour soutenir leur liquidité. @fr
definition: Measures to support the cash flow of forestry companies through tax schemes and start-up aid to improve their cash flow, as well as state-guaranteed loans to support their liquidity.
in scheme: Thesaurus Multirisque FORESTT
preferred label: augmenter la trésorerie de l'entreprise @fr
was quoted from: Adapted from Ministère de l’Agriculture et de l’Agroalimentaire. Plan National Bois. [En ligne]. Ministère de l’Agriculture et de l’Agroalimentaire. [Consulté le 07/04/2026]. <URL : https://agriculture.gouv.fr/sites/default/files/documents/pdf/plan-bois-HD_cle0411e8.pdf>
was quoted from: Adapté de Ministère de l’Agriculture et de l’Agroalimentaire. Plan National Bois. [En ligne]. Ministère de l’Agriculture et de l’Agroalimentaire. [Consulté le 07/04/2026]. <URL : https://agriculture.gouv.fr/sites/default/files/documents/pdf/plan-bois-HD_cle0411e8.pdf> @fr

dense avalanche
has status: Published
type: Concept
alternative label: avalanche coulante @fr
alternative label: flowing avalanche
broader: avalanche
definition: Écoulement monophasique de neige. Elle s'écoule selon une trajectoire très dépendante du relief local, avec de possibles changements brutaux de direction (ex. : le long d'une route) mais elle peut aussi s'étaler largement dans les secteurs à faible pente. Sa vitesse maximale est généralement inférieure à 30 m/s. Sa masse volumique est importante (quelques centaines de kg/m³). @fr
definition: Single-phase snow flow. It flows along a trajectory strongly dependent on local relief, with possible abrupt changes in direction (e.g. along a road), but it can also spread widely in low-slope areas. Its maximum speed is generally below 30 m/s. Its density is high (a few hundred kg/m³).
in scheme: Thesaurus Multirisque FORESTT
preferred label: avalanche dense @fr
was quoted from: Adapté de Guide PPRN Avalanches. Ministère de la Transition écologique. [En ligne]. [Consulté le 03/06/2026]. <URL : https://www.ecologie.gouv.fr/sites/default/files/documents/guide%20PPR%20avalanches-correctif%20f%C3%A9vrier%202022(1).pdf> @fr
was quoted from: Adapted from Guide PPRN Avalanches. Ministère de la Transition écologique. [En ligne]. [Consulté le 03/06/2026]. <URL : https://www.ecologie.gouv.fr/sites/default/files/documents/guide%20PPR%20avalanches-correctif%20f%C3%A9vrier%202022(1).pdf>

crown fire
has status: Published
type: Concept
broader: hazard characterisation
definition: Un feu qui se propage de cime en cime des arbres. @fr
definition: A fire that spreads from treetop to treetop.
in scheme: Thesaurus Multirisque FORESTT
preferred label: feu de cime @fr

ground movement
has status: Published
type: Concept
broader: gravitational hazard
definition: Déplacement gravitaire de masses de terrain déstabilisées sous l'effet de sollicitations naturelles (fonte des neiges, pluviométrie anormalement forte, séismes, etc.) ou anthropiques (terrassement, vibration, déboisement, exploitation de matériaux ou de nappes aquifères, etc.) @fr
definition: Gravitational displacement of destabilised ground masses under the effect of natural (snowmelt, abnormally heavy rainfall, earthquakes, etc.) or human-induced (earthworks, vibration, deforestation, extraction of materials or groundwater, etc.) forces.
in scheme: Thesaurus Multirisque FORESTT
narrower: rapid ground movement
narrower: slow ground movement
preferred label: mouvement de terrain @fr
was quoted from: Géorisques.gouv.fr. Mouvement de terrain. [En ligne]. Paris, Ministère de la Transition écologique. [Consulté le 20/02/2026]. <URL : https://www.georisques.gouv.fr/glossaire/mouvements-de-terrain>. @fr

adaptive forest planning
has status: Published
type: Concept
broader: forest planning for risk adaptation and management
definition: Approche dynamique employée en planification forestière selon laquelle les effets des traitements sylvicoles et les décisions qui en découlent sont l’objet d'un suivi continu et servent, parallèlement aux résultats des recherches entreprises, à ajuster la planification de manière constante afin d'assurer l'atteinte des objectifs en prenant en compte l'évolution des risques. @fr
definition: Dynamic approach used in forest planning whereby the effects of silvicultural treatments and the resulting decisions are continuously monitored and, alongside research findings, used to constantly adjust planning in order to ensure that objectives are met while taking into account the evolution of risks.
in scheme: Thesaurus Multirisque FORESTT
narrower: sustainable management document
preferred label: planification forestière adaptative @fr
was quoted from: Adapté de RNCan - Service canadien des forêts. Glossaire forestier : Sylviculture intensive. [En ligne]. 2019. [Consulté le 25/03/2026]. <URL : https://scf.rncan.gc.ca/termes/vue/282> @fr
was quoted from: Adapted from RNCan - Service canadien des forêts. Glossaire forestier : Sylviculture intensive. [En ligne]. 2019. [Consulté le 25/03/2026]. <URL : https://scf.rncan.gc.ca/termes/vue/282>

fire resilience
has status: Published
type: Concept
broader: forest sensitivity
definition: Capacity of a tree or stand to regenerate after a fire.
definition: Capacité d'un arbre ou d'un peuplement à se régénérer après un incendie. @fr
in scheme: Thesaurus Multirisque FORESTT
preferred label: résilience au feu @fr
was quoted from: Adapté de Revertegat et al. (2025) Synthèse sur la vulnérabilité des peuplements forestiers au feu. Rapport final du projet AFORCE VULNEFEU (Vulnefeu04). [En ligne]. Réseau AFORCE, 2025. [Consulté le 25/03/2026]. <URL : https://www.reseau-aforce.fr/sites/reseau-aforce/files/2025-07/Rapport-Vulnefeu04-compressed.pdf @fr
was quoted from: Adapted from Revertegat et al. (2025) Synthèse sur la vulnérabilité des peuplements forestiers au feu. Rapport final du projet AFORCE VULNEFEU (Vulnefeu04). [En ligne]. Réseau AFORCE, 2025. [Consulté le 25/03/2026]. <URL : https://www.reseau-aforce.fr/sites/reseau-aforce/files/2025-07/Rapport-Vulnefeu04-compressed.pdf

risk score
has status: Published
type: Concept
alternative label: échelle de risque @fr
alternative label: risk scale
broader: risk measure
definition: Valeur numérique attribuée pour mesurer, comparer ou classer un risque. @fr
definition: Numerical value assigned to measure, compare or rank a risk.
in scheme: Thesaurus Multirisque FORESTT
preferred label: score de risque @fr
was quoted from: Groupe de travail « Thésaurus du multirisque en forêt » du projet X-RISKS du PEPR FORESTT (ANR-24-PEFO-0005). [En ligne]. <URL : https://www.pepr-forestt.fr/projets/pc-x-risks> @fr

adapt the access network
has status: Published
type: Concept
broader: adapt forest infrastructure
definition: Ajuster le réseau de pistes forestières à l'évolution du risque. @fr
definition: Adjust the network of forest tracks to changes in risk.
in scheme: Thesaurus Multirisque FORESTT
preferred label: adapter le réseau de dessertes @fr
was quoted from: Groupe de travail « Thésaurus du multirisque en forêt » du projet X-RISKS du PEPR FORESTT (ANR-24-PEFO-0005). [En ligne]. <URL : https://www.pepr-forestt.fr/projets/pc-x-risks> @fr

risk basin
has status: Published
type: Concept
broader: system of interest
definition: Geographic entity subject to the same natural phenomenon (for example a watershed or a homogeneous stretch of a watercourse), allowing the phenomenon to be studied in its entirety and physical reality, independently of administrative boundaries which are reductive.
definition: Entité géographique soumise à un même phénomène naturel (par exemple un bassin versant ou un tronçon homogène de cours d'eau), permettant d'étudier le phénomène dans sa globalité et sa réalité physique, en s'affranchissant des limites administratives qui sont réductrices. @fr
in scheme: Thesaurus Multirisque FORESTT
preferred label: bassin de risque @fr
was quoted from: Adapted from UNALCI. Glossaire. [En ligne]. Union Nationale des Assurances contre les Catastrophes Naturelles et les Inondations (UNALCI). [Consulté le 25/03/2026]. <URL : https://www.unalci-france-inondations.org/glossaire/>
was quoted from: Adapté de UNALCI. Glossaire. [En ligne]. Union Nationale des Assurances contre les Catastrophes Naturelles et les Inondations (UNALCI). [Consulté le 25/03/2026]. <URL : https://www.unalci-france-inondations.org/glossaire/> @fr

systemic vulnerability
has status: Published
type: Concept
broader: emerging risk
definition: All the vulnerabilities of the exposed assets of the system of interest, and their dynamics and interactions.
definition: Ensemble des vulnérabilités des enjeux exposés du système d'intérêt et de leurs dynamiques et interactions. @fr
in scheme: Thesaurus Multirisque FORESTT
preferred label: vulnérabilité systémique @fr
was quoted from: Groupe de travail « Thésaurus du multirisque en forêt » du projet X-RISKS du PEPR FORESTT (ANR-24-PEFO-0005). [En ligne]. <URL : https://www.pepr-forestt.fr/projets/pc-x-risks> @fr

drought intensity
has status: Published
type: Concept
broader: hazard characterisation
definition: Degree of a water deficit measured by standardised indices.
definition: Degré d'un déficit hydrique mesuré par des indices standardisés. @fr
in scheme: Thesaurus Multirisque FORESTT
preferred label: intensité de la sécheresse @fr
was quoted from: Adapted from INRAE. Rapport Sécheresse. [En ligne]. [Consulté le 20/02/2026]. <URL : https://www.inrae.fr/sites/default/files/pdf/s%c3%a9cheresse%20rapport%20complet.pdf>.
was quoted from: Adapté de INRAE. Rapport Sécheresse. [En ligne]. [Consulté le 20/02/2026]. <URL : https://www.inrae.fr/sites/default/files/pdf/s%c3%a9cheresse%20rapport%20complet.pdf>. @fr

virulence
has status: Published
type: Concept
broader: disease severity
definition: Capacité d'un pathogène à se multiplier augmentant la sévérité d'une maladie. @fr
definition: Capacity of a pathogen to multiply, increasing the severity of a disease.
in scheme: Thesaurus Multirisque FORESTT
was quoted from: Groupe de travail « Thésaurus du multirisque en forêt » du projet X-RISKS du PEPR FORESTT (ANR-24-PEFO-0005). [En ligne]. <URL : https://www.pepr-forestt.fr/projets/pc-x-risks> @fr

sensitivity related to species composition
has status: Published
type: Concept
broader: forest sensitivity
definition: Mesure dans laquelle un écosystème forestier est affecté par l'exposition à un aléa du fait de sa composition en essences. @fr
definition: Extent to which a forest ecosystem is affected by exposure to a hazard due to its species composition.
in scheme: Thesaurus Multirisque FORESTT
narrower: pure stand
narrower: resilient species
narrower: species composition
preferred label: sensibilité liée à la composition spécifique @fr
was quoted from: Groupe de travail « Thésaurus du multirisque en forêt » du projet X-RISKS du PEPR FORESTT (ANR-24-PEFO-0005). [En ligne]. <URL : https://www.pepr-forestt.fr/projets/pc-x-risks> @fr

structural assistance
has status: Published
type: Concept
broader: response to protect the wood sector
definition: Assistance for the structural modernisation of the forest-wood sector, for the acquisition of equipment and structuring investments, whether for forestry work companies or wood-processing companies.
definition: Aide à la modernisation structurelle de la filière forêt-bois, pour l'acquisition de matériels et des investissements structurants qu’il s’agisse des entreprises de travaux forestiers ou des entreprises de transformation du matériau bois. @fr
in scheme: Thesaurus Multirisque FORESTT
narrower: DEFI scheme
narrower: modernisation plan for processing industries
preferred label: aide structurelle @fr
was quoted from: Adapted from Ministère de la Transition écologique. Soutien à la croissance et à la modernisation de la filière forêt-bois française : les lauréats de trois appels à projets dévoilés. 2025. [En ligne]. Ministère de la Transition écologique. [Consulté le 07/04/2026]. <URL : https://www.ecologie.gouv.fr/presse/soutien-croissance-modernisation-filiere-foret-bois-francaise-laureats-trois-appels-projets>
was quoted from: Adapté de Ministère de la Transition écologique. Soutien à la croissance et à la modernisation de la filière forêt-bois française : les lauréats de trois appels à projets dévoilés. 2025. [En ligne]. Ministère de la Transition écologique. [Consulté le 07/04/2026]. <URL : https://www.ecologie.gouv.fr/presse/soutien-croissance-modernisation-filiere-foret-bois-francaise-laureats-trois-appels-projets> @fr

low asset diversification of owners
has status: Published
type: Concept
broader: socio-economic profile of the owner
definition: Vulnérabilité des propriétaires forestiers liée à un manque de diversification en composition et en structure de leurs forêts. @fr
definition: Vulnerability of forest owners related to a lack of diversification in the composition and structure of their forests.
in scheme: Thesaurus Multirisque FORESTT
preferred label: faible diversifications des actifs des propriétaires @fr
was quoted from: Groupe de travail « Thésaurus du multirisque en forêt » du projet X-RISKS du PEPR FORESTT (ANR-24-PEFO-0005). [En ligne]. <URL : https://www.pepr-forestt.fr/projets/pc-x-risks> @fr

wild ungulate
has status: Published
type: Concept
alternative label: grand gibier @fr
alternative label: grande faune @fr
alternative label: big game
alternative label: large fauna
broader: plant bioagressor
definition: Mammifère herbivore pourvu de sabots. @fr
definition: Hoofed herbivorous mammal.
in scheme: Thesaurus Multirisque FORESTT
preferred label: ongulé sauvage @fr
was quoted from: Adapté OFB. Dataviz présence ongulés sauvages en France. [En ligne]. [Consulté le 20/02/2026]. <URL : https://professionnels.ofb.fr/fr/doc-dataviz/dataviz-presence-ongules-sauvages-en-france>. @fr

loss of local knowledge
has status: Published
type: Concept
broader: lack of risk culture
definition: Vulnerability of the forest-wood sector related to the loss of detailed local knowledge by local forestry actors.
definition: Vulnérabilité de la filière forêt-bois liée à la perte de connaissance fine du terrain par les acteurs forestiers locaux. @fr
in scheme: Thesaurus Multirisque FORESTT
preferred label: perte de la connaissance du terrain @fr
was quoted from: Groupe de travail « Thésaurus du multirisque en forêt » du projet X-RISKS du PEPR FORESTT (ANR-24-PEFO-0005). [En ligne]. <URL : https://www.pepr-forestt.fr/projets/pc-x-risks> @fr

drought
has status: Published
type: Concept
alternative label: déficit hydrique @fr
alternative label: water deficit
broader: natural hazard
definition: Déficit anormal, sur une période prolongée, d’une (au moins) des composantes du cycle hydrologique terrestre. On distingue la sécheresse météorologique qui correspond à un déficit prolongé de précipitations, la sécheresse édaphique, c’est-à-dire du sol, dite aussi sécheresse agricole car elle impacte directement la production agricole, et la sécheresse hydrologique correspond à un déficit de débit des cours d’eau, des niveaux bas des nappes ou des retenues, sur une période ou une année pendant laquelle les débits sont très inférieurs à la moyenne. @fr
definition: Abnormal deficit, over a prolonged period, of at least one component of the terrestrial hydrological cycle. A distinction is made between meteorological drought, corresponding to a prolonged rainfall deficit; edaphic (soil) drought, also called agricultural drought because it directly impacts agricultural production; and hydrological drought, corresponding to a deficit in watercourse flow, or low levels in groundwater or reservoirs, over a period or year during which flows are well below average.
in scheme: Thesaurus Multirisque FORESTT
narrower: atmospheric drought
narrower: edaphic drought
preferred label: sécheresse @fr
was quoted from: INRAE (2020) Qu’est-ce que la sécheresse ? [En ligne]. [Consulté le 05/03/2026]. <URL : https://www.inrae.fr/actualites/quest-ce-que-secheresse>. @fr

severity
has status: Published
type: Concept
alternative label: magnitude of damage
alternative label: magnitude des dégâts/dommages @fr
broader: damage characterisation
definition: Degré de gravité des dommages subis et difficultés de récupération de l'écosystème. @fr
definition: Degree of severity of the damage sustained and difficulty of ecosystem recovery.
in scheme: Thesaurus Multirisque FORESTT
preferred label: sévérité @fr

tornado
type: Concept
broader: violent wind
definition: Phénomène orageux générant un tourbillon de vents violents se développant sous un cumulonimbus et se prolongeant jusqu'à terre. En France, leur diamètre varie de quelques dizaines à plusieurs centaines de mètres, pour un parcours de quelques kilomètres et une durée de vie dépassant rarement 15 minutes. Les vitesses atteintes peuvent largement dépasser celles d'une tempête. @fr
definition: Stormy phenomenon generating a vortex of violent winds developing beneath a cumulonimbus and extending to the ground. In France, their diameter varies from a few tens to several hundred metres, over a path of a few kilometres, with a lifespan rarely exceeding 15 minutes. The speeds reached can far exceed those of a storm.
in scheme: Thesaurus Multirisque FORESTT
preferred label: tornade @fr
was quoted from: Groupe de travail « Thésaurus du multirisque en forêt » du projet X-RISKS du PEPR FORESTT (ANR-24-PEFO-0005). [En ligne]. <URL : https://www.pepr-forestt.fr/projets/pc-x-risks> @fr

mass rock collapse
has status: Published
type: Concept
alternative label: effondrement @fr
alternative label: collapse
broader: rapid ground movement
definition: Détachement brutal, depuis une paroi (sub)verticale, d’une masse rocheuse de volume pouvant atteindre plusieurs millions de m3, et qui se propage rapidement vers l’aval sous l’effet de la gravité. @fr
definition: Sudden detachment, from a (sub)vertical rock face, of a rock mass that can reach several million m3, which rapidly propagates downhill under the effect of gravity.
in scheme: Thesaurus Multirisque FORESTT
preferred label: écroulement de masse @fr
was quoted from: Adapté de INRAE. Chutes de blocs et risque rocheux : quand la montagne gronde. [En ligne]. Publié le 15 avril 2024. [Consulté le 25/03/2026]. <URL : https://www.inrae.fr/dossiers/chutes-blocs-risque-rocheux-quand-montagne-gronde> @fr
was quoted from: Adapted from INRAE. Chutes de blocs et risque rocheux : quand la montagne gronde. [En ligne]. Publié le 15 avril 2024. [Consulté le 25/03/2026]. <URL : https://www.inrae.fr/dossiers/chutes-blocs-risque-rocheux-quand-montagne-gronde>

sécheresse
type: Collection
in scheme: Thesaurus Multirisque FORESTT
member: national FRM regulation
member: regional recommendation sheet
member: species mixing
member: weeding
member: rely on natural regeneration or seeding
member: thinning
member: growth cessation
member: leaf desiccation
member: decline
member: cavitation
member: sensitivity related to soil-climate conditions
member: drought
member: heatwave
member: date of occurrence of drought
member: drought duration
member: drought intensity
member: sensitivity related to site conditions
member: sensitivity related to water conditions
member: shallow root exploration depth
member: soil with low available water capacity
member: atmospheric drought
member: edaphic drought
member: exceptional atmospheric drought
member: exceptional edaphic drought
member: high LAI (leaf area index)
member: weather characteristic
member: xeric site

exposed forestry work contractor
has status: Published
type: Concept
alternative label: débardeur @fr
alternative label: transporteur @fr
alternative label: carrier
alternative label: skidder operator
broader: exposed actor of the forest-wood sector
definition: Entrepreneur de travaux forestiers susceptible de subir des dommages, du fait de son exposition à des aléas. @fr
definition: Forestry work contractor likely to suffer damage due to exposure to hazards.
in scheme: Thesaurus Multirisque FORESTT
preferred label: entrepreneur de travaux forestiers exposé @fr
was quoted from: Groupe de travail « Thésaurus du multirisque en forêt » du projet X-RISKS du PEPR FORESTT (ANR-24-PEFO-0005). [En ligne]. <URL : https://www.pepr-forestt.fr/projets/pc-x-risks> @fr

prescribed burning
has status: Published
type: Concept
broader: silvicultural action
definition: Opération qui consiste à destruire par le feu, de façon planifiée et contrôlée sur un périmètre prédéfini, et en toute sécurité pour les espaces limitrophes, le combustible du sous bois dont le maintien est de nature à favoriser la propagation des incendie. @fr
definition: An operation consisting of destroying by fire, in a planned and controlled manner within a predefined perimeter and with full safety for surrounding areas, the understory fuel whose persistence tends to favour fire spread.
in scheme: Thesaurus Multirisque FORESTT
preferred label: brûlage dirigé @fr
was quoted from: Adapté de Duché & Rigolot (2004) Rendez-vous techniques de l'ONF n°4, pp. 36-40. [En ligne]. HAL open science. [Consulté le 02/04/2026]. <URL : https://hal.inrae.fr/hal-02673729v1/file/RDVT04_p36-40.pdf> @fr
was quoted from: Adapted from Duché & Rigolot (2004) Rendez-vous techniques de l'ONF n°4, pp. 36-40. [En ligne]. HAL open science. [Consulté le 02/04/2026]. <URL : https://hal.inrae.fr/hal-02673729v1/file/RDVT04_p36-40.pdf>

genotype mixing through planting
has status: Published
type: Concept
broader: genotype mixing
definition: Plantation d'arbres de constitutions génétiques variées pour augmenter la résistance du peuplement mélangé face aux risques biotiques et abiotiques. @fr
definition: Planting of trees of varied genetic makeup to increase the resistance of the mixed stand to biotic and abiotic risks.
in scheme: Thesaurus Multirisque FORESTT
narrower: varietal mixture
narrower: genetic enrichment
preferred label: mélange de génotypes par plantation @fr
was quoted from: Adapté de RNCan - Service canadien des forêts. Glossaire forestier : Sylviculture intensive. [En ligne]. 2019. [Consulté le 25/03/2026]. <URL : https://scf.rncan.gc.ca/termes/vue/642> @fr
was quoted from: Adapted from RNCan - Service canadien des forêts. Glossaire forestier : Sylviculture intensive. [En ligne]. 2019. [Consulté le 25/03/2026]. <URL : https://scf.rncan.gc.ca/termes/vue/642>

sustainable management document
has status: Published
type: Concept
alternative label: aménagement @fr
alternative label: forest management plan
broader: adaptive forest planning
definition: Document organisant les coupes et travaux dans une forêt pour les 10 à 20 ans à venir pouvant inclure un volet sur l'évaluation et la gestion des risques. Il comprend en en forêts privées les plans simples de gestion et en forêts publiques les directives régionales d'aménagement (DRA) s'appliquant aux forêts domaniales (propriété de l’État) et les schémas régionaux d'aménagement (SRA) s'appliquant aux bois et forêts des collectivités, déclinés localement en aménagements forestiers. @fr
definition: Document organising cuttings and works in a forest for the next 10 to 20 years, which may include a risk assessment and management component. In private forests it comprises simple management plans, and in public forests the regional development guidelines (DRA) applying to state-owned forests and the regional development schemes (SRA) applying to municipal woods and forests, locally translated into forest management plans.
in scheme: Thesaurus Multirisque FORESTT
narrower: shortening of the rotation
narrower: diversification of treatments
narrower: abandonment of forest use
preferred label: document de gestion durable @fr
was quoted from: Adapté de ONF. Gérer les forêts. [En ligne]. Office national des forêts. [Consulté le 01/04/2026]. <URL : https://www.onf.fr/onf/lonf-agit/+/15%3A%3Agerer-les-forets.html> @fr
was quoted from: Adapted from ONF. Gérer les forêts. [En ligne]. Office national des forêts. [Consulté le 01/04/2026]. <URL : https://www.onf.fr/onf/lonf-agit/+/15%3A%3Agerer-les-forets.html>

fire occurrence probability
has status: Published
type: Concept
broader: hazard characterisation
definition: Probability that a fire will start in a given area, generally over an annual period.
definition: Probabilité qu’un incendie se déclare dans une zone donnée en général sur une période annuelle. @fr
in scheme: Thesaurus Multirisque FORESTT
preferred label: probabilité d’occurrence de l’incendie @fr

economic loss
has status: Published
type: Concept
broader: loss for the wood sector
definition: Dégradation de l'activité économique que ce soit en termes de production, d'emploi, ou de croissance de la filière forêt-bois ou de l'un de ses acteurs. @fr
definition: Deterioration of economic activity, whether in terms of production, employment, or growth of the forest-wood sector or one of its actors.
in scheme: Thesaurus Multirisque FORESTT
narrower: economic loss for the company
narrower: economic loss for the forest owner
narrower: loss of economic viability of the company
preferred label: perte économique @fr
was quoted from: Groupe de travail « Thésaurus du multirisque en forêt » du projet X-RISKS du PEPR FORESTT (ANR-24-PEFO-0005). [En ligne]. <URL : https://www.pepr-forestt.fr/projets/pc-x-risks> @fr

systemic risk
has status: Published
type: Concept
broader: emerging risk
definition: Risque résultant des liens entre les risques (risques en réseau), où une défaillance initiale localisée pourrait avoir des effets désastreux et, dans le pire des cas, causer des dommages illimités. @fr
definition: Risk resulting from the links between risks (networked risks), where an initial localised failure could have disastrous effects and, in the worst case, cause unlimited damage.
in scheme: Thesaurus Multirisque FORESTT
preferred label: risque systémique @fr
was quoted from: Adapté de Schweizer & Juhola (2024). Navigating systemic risks: governance of and for systemic risks. Global Sustainability, 7, e38, pp. 1-12. [En ligne]. [Consulté le 03/06/2026]. <URL : https://doi.org/10.1017/sus.2024.30> @fr
was quoted from: Adapted from Schweizer & Juhola (2024). Navigating systemic risks: governance of and for systemic risks. Global Sustainability, 7, e38, pp. 1-12. [En ligne]. [Consulté le 03/06/2026]. <URL : https://doi.org/10.1017/sus.2024.30>

hazard characterisation
has status: Published
type: Concept
broader: hazard affecting the forest
definition: Description des propriétés (durée, intensité, probabilité) d’un aléa. @fr
definition: Description of the properties (duration, intensity, probability) of a hazard.
in scheme: Thesaurus Multirisque FORESTT
narrower: outbreak focus
narrower: disease emergence
narrower: prevalence
narrower: disease severity
narrower: epidemic
narrower: primary pest
narrower: secondary pest
narrower: date of occurrence of drought
narrower: wind gust speed
narrower: avalanche intensity
narrower: snow depth
narrower: wet snow
narrower: flame front
narrower: drought duration
narrower: drought intensity
narrower: flood duration
narrower: outbreak
narrower: fire severity
narrower: fire intensity
narrower: frost duration
narrower: fire occurrence probability
narrower: induced hazard
narrower: experienced hazard
narrower: fire occurrence
narrower: spotting
narrower: crown fire
narrower: surface fire
narrower: fire activity
narrower: burnt area
narrower: frost intensity
narrower: range expansion
narrower: invasive alien species
narrower: emerging organism
narrower: water level
narrower: date of occurrence of root system waterlogging
narrower: duration of root system waterlogging
narrower: root system waterlogging intensity
narrower: heatwave duration
narrower: heatwave intensity
narrower: date of occurrence of frost
narrower: flow rate
preferred label: caractérisation de l’aléa @fr
was quoted from: Adapté de INRAE. Anatomie du risque (Infographie). [En ligne]. [Consulté le 20/02/2026]. <URL : https://www.inrae.fr/sites/default/files/ressources7_infographie_anatomie_du_risque.pdf>. @fr
was quoted from: Adapted from INRAE. Anatomie du risque (Infographie). [En ligne]. [Consulté le 20/02/2026]. <URL : https://www.inrae.fr/sites/default/files/ressources7_infographie_anatomie_du_risque.pdf>.

leafroller
has status: Published
type: Concept
broader: foliage pest insect
definition: Lépidoptère dont les chenilles plient, roulent ou agglomèrent les feuilles entre elles par des fils ou des tissus de soie. @fr
definition: Lepidopteran whose caterpillars fold, roll or bind leaves together using silk threads or webbing.
in scheme: Thesaurus Multirisque FORESTT
preferred label: tordeuse des feuilles @fr
was quoted from: EPHYTIA-INRAE. Tortricidae - tordeuses. [En ligne]. [Consulté le 20/02/2026]. <URL : https://ephytia.inrae.fr/fr/C/11363/Hypp-encyclopedie-en-protection-des-plantes-Tortricidae-tordeuses>. @fr

vulnerability of the forest
has status: Published
type: Concept
broader: risk to the forest
definition: Propensity or predisposition of the forest to suffer damage. A notion encompassing various concepts and elements, such as sensitivity or fragility and the inability to cope and adapt.
definition: Propension ou prédisposition de la forêt à subir des dommages. Notion englobant divers concepts et éléments, tels que la sensibilité ou la fragilité et l’incapacité de faire face et de s’adapter. @fr
in scheme: Thesaurus Multirisque FORESTT
narrower: forest sensitivity
narrower: sensitivity related to soil-climate conditions
narrower: lack of adaptive capacity
preferred label: vulnérabilité de la forêt @fr
was quoted from: Adapté de GIEC (2018) Glossaire. [En ligne]. Genève, GIEC. [Consulté le 20/02/2026]. <URL : https://www.ipcc.ch/site/assets/uploads/sites/2/2019/10/SR15_Glossary_french.pdf>. @fr
was quoted from: Adapted from GIEC (2018) Glossaire. [En ligne]. Genève, GIEC. [Consulté le 20/02/2026]. <URL : https://www.ipcc.ch/site/assets/uploads/sites/2/2019/10/SR15_Glossary_french.pdf>.

oomycete disease
has status: Published
type: Concept
broader: non-fungal phytopathogenic agent
definition: Maladies forestières causées par les oomycètes (mildiou, encre du châtaignier), agents parthogènes aquatiques provoquant pourritures et mortalité. @fr
definition: Forest diseases caused by oomycetes (downy mildew, chestnut ink disease), aquatic pathogenic agents causing rot and mortality.
in scheme: Thesaurus Multirisque FORESTT
preferred label: maladie due aux oomycètes @fr
was quoted from: Adapté de INRAE. L'agrégation des oomycètes enfin décryptée. 2021. [En ligne]. Institut national de recherche pour l'agriculture, l'alimentation et l'environnement. [Consulté le 07/04/2026]. <URL : https://www.inrae.fr/actualites/lagregation-oomycetes-enfin-decryptee> @fr
was quoted from: Adapted from INRAE. L'agrégation des oomycètes enfin décryptée. 2021. [En ligne]. Institut national de recherche pour l'agriculture, l'alimentation et l'environnement. [Consulté le 07/04/2026]. <URL : https://www.inrae.fr/actualites/lagregation-oomycetes-enfin-decryptee>

rapid ground movement
has status: Published
type: Concept
broader: ground movement
definition: Sudden and violent displacement of soil and subsoil, which can be divided into two groups according to the mode of material propagation, in mass or in a reworked state. The first group includes: collapses, rockfalls or block falls, rock slides or rock falls, certain rock slides. The second group includes: debris flows and mudflows.
definition: Déplacement soudain et brutal de sols et sous-sols qui peuvent être scindés en deux groupes, selon le mode de propagation des matériaux, en masse, ou à l'état remanié. Le premier groupe comprend : les effondrements, les chutes de pierres ou de blocs, les éboulements ou écroulements, certains glissements rocheux. Le second groupe comprend : les laves torrentielles et les coulées boueuses. @fr
in scheme: Thesaurus Multirisque FORESTT
narrower: mass rock collapse
narrower: rockfall
narrower: rock slide
preferred label: mouvement de terrain rapide @fr
was quoted from: Adapted from Géorisques.gouv.fr. Mouvement de terrain. [En ligne]. Paris, Ministère de la Transition écologique. [Consulté le 20/02/2026]. <URL : https://www.georisques.gouv.fr/minformer-sur-un-risque/mouvement-de-terrain>.
was quoted from: Adapté de Géorisques.gouv.fr. Mouvement de terrain. [En ligne]. Paris, Ministère de la Transition écologique. [Consulté le 20/02/2026]. <URL : https://www.georisques.gouv.fr/minformer-sur-un-risque/mouvement-de-terrain>. @fr

pure stand
has status: Published
type: Concept
alternative label: monospecific stand
alternative label: peuplement monospécifique @fr
broader: sensitivity related to species composition
definition: Stand where one species occupies more than 75% of the dominant cover.
definition: Peuplement où une essence occupe plus de 75 % du couvert dominant. @fr
in scheme: Thesaurus Multirisque FORESTT
narrower: pure stand with low genetic diversity
preferred label: peuplement pur @fr
was quoted from: Adapted from IGN - Inventaire Forestier. P - Peuplement (composition). [En ligne]. Institut national de l’information géographique et forestière (IGN), © 2025. [Consulté le 25/03/2026]. <URL : https://inventaire-forestier.ign.fr/spip.php?article599#peupcomp>
was quoted from: Adapté de IGN - Inventaire Forestier. P - Peuplement (composition). [En ligne]. Institut national de l’information géographique et forestière (IGN), © 2025. [Consulté le 25/03/2026]. <URL : https://inventaire-forestier.ign.fr/spip.php?article599#peupcomp> @fr

inter-service competition
has status: Published
type: Concept
broader: societal and organisational vulnerability
definition: Vulnerability of the forest-wood sector related to competition and lack of cooperation between forestry sector services and risk management.
definition: Vulnérabilité de la filière forêt-bois liée à la concurrence et au manque de coopération inter-services du secteur fdorestier et de al gestion des risques. @fr
in scheme: Thesaurus Multirisque FORESTT
preferred label: compétition inter-services @fr
was quoted from: Groupe de travail « Thésaurus du multirisque en forêt » du projet X-RISKS du PEPR FORESTT (ANR-24-PEFO-0005). [En ligne]. <URL : https://www.pepr-forestt.fr/projets/pc-x-risks> @fr

gall-forming insect
has status: Published
type: Concept
broader: foliage pest insect
definition: Insect causing the formation of galls on plant tissue.
definition: Insecte provoquant la formation de galles sur les tissus végétaux. @fr
in scheme: Thesaurus Multirisque FORESTT
preferred label: galigène @fr
was quoted from: Adapté de EPHYTIA-INRAE. [En ligne]. [Consulté le 20/02/2026]. <URL : https://ephytia.inrae.fr/fr/C/18521/Forets-Champignons-et-autres-pathogenes>. @fr
was quoted from: Adapted from EPHYTIA-INRAE. [En ligne]. [Consulté le 20/02/2026]. <URL : https://ephytia.inrae.fr/fr/C/18521/Forets-Champignons-et-autres-pathogenes>.

late frost
has status: Published
type: Concept
broader: frost
definition: Gelée survenant au printemps après le débourrement des bourgeons. @fr
definition: Frost occurring in spring after bud burst.
in scheme: Thesaurus Multirisque FORESTT
preferred label: gelée tardive @fr
was quoted from: Adapté de Aussenac (1970). Gelées tardives et jeunes peuplements forestiers. Revue forestière française, 22, pp. 463-469. [En ligne]. [Consulté le 03/06/2026]. <URL : https://doi.org/10.4267/2042/20379> @fr
was quoted from: Adapted from Aussenac (1970). Gelées tardives et jeunes peuplements forestiers. Revue forestière française, 22, pp. 463-469. [En ligne]. [Consulté le 03/06/2026]. <URL : https://doi.org/10.4267/2042/20379>

insecte
type: Collection
in scheme: Thesaurus Multirisque FORESTT
member: plant bioagressor
member: biological control
member: national emergency health intervention plan (PNISU) for Bursaphelenchus xylophilus (pine wood nematode)
member: general surveillance
member: insecticide treatment
member: containment
member: road safety clearance
member: semiochemical treatment
member: eradication
member: plant passport
member: treatment or extraction of felled logs
member: fertilisation
member: grey stage
member: wood boring
member: defoliated tree
member: red stage
member: genetic sensitivity of stand components
member: species composition
member: piercing-sucking insect
member: foliage pest insect
member: pest insect
member: skeletoniser
member: gall-forming insect
member: chewing insect
member: leaf miner
member: leafroller
member: outbreak
member: range expansion
member: invasive alien species
member: emerging organism
member: bark-feeding insect
member: wood-boring insect
member: branch and trunk pest insect
member: xylem-feeding insect
member: cambium-feeding insect
member: structural heterogeneity
member: early detection
member: sentinel nursery
member: multi-pheromone attractant
member: targeted monitoring
member: stand density
member: sensitivity related to forest structure
member: trigger an "exceptional" diagnosis of the current state of the management unit
member: observer network (DSF)
member: DSF database
member: indicator monitoring
member: chemical insecticide treatment
member: non-chemical insecticide treatment
member: reproductive organ pest insect
member: vector insect
member: root pest insect
member: social status of the tree
member: suppressed tree
member: stand age
member: pheromone trap
member: use of attractants
member: insecticide trap
member: sanitary felling
member: early harvest
member: aged stand
member: wood transport ban
member: conservation biological control
member: classical biological control
member: installation of tit nest boxes
member: use of repellents
member: insufficiently thinned stand
member: seed-feeding insect
member: pine wood nematode vector insect
member: even-aged stand
member: homogeneous diameter structure
member: associational resistance
member: root cambium-feeding insect
member: xylomycetophagous insect
member: root xylem-feeding insect

risk management
has status: Published
type: Concept
broader: risk component
definition: Plans, mesures, stratégies ou politiques qui sont mis en place pour réduire la probabilité d’occurrence d’un risque, pour en limiter les conséquences ou pour faire face à celles-ci. @fr
definition: Plans, measures, strategies or policies implemented to reduce the probability of a risk occurring, to limit its consequences, or to cope with them.
in scheme: Thesaurus Multirisque FORESTT
narrower: risk management measure
preferred label: gestion du risque @fr
was quoted from: GIEC (2018) Glossaire. Rapport spécial sur les conséquences d’un réchauffement planétaire de 1,5 °C. [En ligne]. Genève, GIEC. [Consulté le 20/02/2026]. <URL : https://www.ipcc.ch/site/assets/uploads/sites/2/2019/10/SR15_Glossary_french.pdf>. @fr

risk scenario
has status: Published
type: Concept
broader: risk
definition: Plausible description of the future occurrence of one or more risks, based on a coherent and intrinsically consistent set of assumptions concerning the main driving forces (rate of technological change, prices, etc.) and the relationships at play.
definition: Description vraisemblable, de réalisation future d'un risque ou de plusieurs risques, fondée sur un ensemble cohérent et intrinsèquement homogène d’hypothèses concernant les principales forces motrices (rythme de l’évolution technologique, prix, etc.) et les relations en jeu. @fr
in scheme: Thesaurus Multirisque FORESTT
preferred label: scénario de risque @fr
was quoted from: Adapté de GIEC (2018) Glossaire. [En ligne]. Genève, GIEC. [Consulté le 20/02/2026]. <URL : https://www.ipcc.ch/site/assets/uploads/sites/2/2019/10/SR15_Glossary_french.pdf>. @fr
was quoted from: Adapted from GIEC (2018) Glossaire. [En ligne]. Genève, GIEC. [Consulté le 20/02/2026]. <URL : https://www.ipcc.ch/site/assets/uploads/sites/2/2019/10/SR15_Glossary_french.pdf>.

forest fire risk prevention plan (PPRIF)
has status: Published
type: Concept
broader: foreseeable natural risk prevention plan
definition: Document established by the State in consultation with local authorities, which regulates the use of land exposed to forest fire risk, taking the form of a public utility easement appended to the urban planning document, binding on all - individuals, businesses, local authorities and the state - in order to take these risks into account in land-use planning.
definition: Document établi par l'Etat en concertation avec les collectivités, qui réglemente l'utilisation des sols exposés aux risques d'incendie de forêt, se traduisant par une servitude d'utilité publique annexée au document d'urbanisme s'imposant à tous - particuliers, entreprises, collectivités et état -, pour la prise en compte de ces risques dans l'aménagement du territoire. @fr
in scheme: Thesaurus Multirisque FORESTT
preferred label: plan de prévention du risque incendie de forêt (pprif) @fr
was quoted from: Adapted from Géorisques.gouv.fr. [En ligne]. Paris, Ministère de la Transition écologique. [Consulté le 20/02/2026]. <URL : https://www.bouches-du-rhone.gouv.fr/actions-de-l-etat/environnement-risques-naturels-et-technologiques/la-prevention/les-projets-de-plans-de-prevention-des-risques-d-incendies-de-forets-pprif>.
was quoted from: Adapté de Géorisques.gouv.fr. [En ligne]. Paris, Ministère de la Transition écologique. [Consulté le 20/02/2026]. <URL : https://www.bouches-du-rhone.gouv.fr/actions-de-l-etat/environnement-risques-naturels-et-technologiques/la-prevention/les-projets-de-plans-de-prevention-des-risques-d-incendies-de-forets-pprif>. @fr

sensitivity related to nitrogen management
has status: Published
type: Concept
broader: sensitivity related to phenology
definition: Extent to which a forest species is affected by a hazard due to its difficulties in using nitrogen.
definition: Mesure dans laquelle une espèce forestière est affectée par un aléa du fait de ses difficultés à utiliser l'azote. @fr
in scheme: Thesaurus Multirisque FORESTT
preferred label: sensibilité liée à la gestion de l'azote @fr
was quoted from: Groupe de travail « Thésaurus du multirisque en forêt » du projet X-RISKS du PEPR FORESTT (ANR-24-PEFO-0005). [En ligne]. <URL : https://www.pepr-forestt.fr/projets/pc-x-risks> @fr

standing timber price instability
has status: Published
type: Concept
broader: market instability
definition: Fluctuation forte du prix du bois sur pied. @fr
definition: Strong fluctuation in the price of standing timber.
in scheme: Thesaurus Multirisque FORESTT
narrower: drop in timber prices
narrower: rise in wood prices
preferred label: instabilité du prix du bois sur pied @fr
was quoted from: Adapté de Forestopic. Le prix du bois sur pied fait une remontada. [En ligne]. Forestopic. [Consulté le 07/04/2026]. <URL : https://www.forestopic.com/fr/foret/economie/1893-prix-bois-sur-pied-remontada?highlight=WyJwcml4Il0=> @fr
was quoted from: Adapted from Forestopic. Le prix du bois sur pied fait une remontada. [En ligne]. Forestopic. [Consulté le 07/04/2026]. <URL : https://www.forestopic.com/fr/foret/economie/1893-prix-bois-sur-pied-remontada?highlight=WyJwcml4Il0=>

stump treatment
has status: Published
type: Concept
broader: biological control
definition: Application d’un phytocide sur les souches des feuillus ou à proximité afin d’empêcher la production de rejets ou de drageons ou prévenir la propagation d'un agent pathogène. @fr
definition: Application of a herbicide on or near the stumps of broadleaved trees to prevent the production of suckers or shoots, or to prevent the spread of a pathogen.
in scheme: Thesaurus Multirisque FORESTT
preferred label: badigeon de souche @fr
was quoted from: Adapté de RNCan - Service canadien des forêts. Glossaire forestier : Sylviculture intensive. [En ligne]. 2019. [Consulté le 25/03/2026]. <URL : https://scf.rncan.gc.ca/termes/vue/1141> @fr
was quoted from: Adapted from RNCan - Service canadien des forêts. Glossaire forestier : Sylviculture intensive. [En ligne]. 2019. [Consulté le 25/03/2026]. <URL : https://scf.rncan.gc.ca/termes/vue/1141>

host species
type: Concept
broader: species-specific sensitivity
definition: Espèce végétale capable d'héberger un agent pathogène et de lui fournir les conditions nécessaires à son installation, à sa survie et, souvent, à sa multiplication. @fr
definition: Plant species capable of harbouring a pathogen and providing it with the conditions necessary for its establishment, survival and, often, its multiplication.
in scheme: Thesaurus Multirisque FORESTT
narrower: sensitive host
narrower: tolerant host
narrower: reservoir host
preferred label: espèce hôte @fr
was quoted from: Groupe de travail « Thésaurus du multirisque en forêt » du projet X-RISKS du PEPR FORESTT (ANR-24-PEFO-0005). [En ligne]. <URL : https://www.pepr-forestt.fr/projets/pc-x-risks> @fr

date of occurrence of root system waterlogging
has status: Published
type: Concept
alternative label: saison d'occurrence de l'engorgement @fr
alternative label: season of occurrence of waterlogging
broader: hazard characterisation
definition: Date de début et fin d’un épisode d’ennoyage du système racinaire @fr
definition: Start and end date of a root system waterlogging episode.
in scheme: Thesaurus Multirisque FORESTT
preferred label: date d'occurrence d'engorgement du système racinaire @fr
was quoted from: Adapté de ONF (2005) RDVT 73-22-28. [En ligne]. [Consulté le 20/02/2026]. <URL : https://old.foretnature.be/images/stories/pdffolder/FO163-SOLS-BIBLIO-6-ONF_RDVT_73-22-28.pdf>. @fr
was quoted from: Adapted from ONF (2005) RDVT 73-22-28. [En ligne]. [Consulté le 20/02/2026]. <URL : https://old.foretnature.be/images/stories/pdffolder/FO163-SOLS-BIBLIO-6-ONF_RDVT_73-22-28.pdf>.

risk to the wood sector
has status: Published
type: Concept
definition: Éventualité de conséquences néfastes pour la filière bois, dont l’occurrence ou l’ampleur sont incertaines. Résultat de l'interaction de la vulnérabilité (de la filière bois), de la durée d’exposition (à l’aléa), de l’aléa considéré et de sa probabilité d’occurrence. @fr
definition: The potential for adverse consequences for the wood sector, the occurrence or magnitude of which is uncertain. It results from the interaction of the vulnerability (of the wood sector), the duration of exposure (to the hazard), the hazard considered and its probability of occurrence.
in scheme: Thesaurus Multirisque FORESTT
narrower: exposed asset of the wood sector
narrower: hazard threatening the wood industry
narrower: vulnerability of the wood sector
narrower: response to protect the wood sector
preferred label: risque pour la filière bois @fr
top concept of: Thesaurus Multirisque FORESTT
was quoted from: Adapté de GIEC (2018) Glossaire. Rapport spécial sur les conséquences d’un réchauffement planétaire de 1,5 °C. [En ligne]. Genève, GIEC. [Consulté le 20/02/2026]. <URL : https://www.ipcc.ch/site/assets/uploads/sites/2/2019/10/SR15_Glossary_french.pdf>. @fr
was quoted from: Adapted from GIEC (2018) Glossaire. Rapport spécial sur les conséquences d’un réchauffement planétaire de 1,5 °C. [En ligne]. Genève, GIEC. [Consulté le 20/02/2026]. <URL : https://www.ipcc.ch/site/assets/uploads/sites/2/2019/10/SR15_Glossary_french.pdf>.

economic loss for the forest owner
has status: Published
type: Concept
broader: economic loss
definition: Dégradation de l'activité économique que ce soit en termes de production, d'emploi, ou de croissance d'un propriétaire forestier. @fr
definition: Deterioration of economic activity, whether in terms of production, employment, or growth, for a forest owner.
in scheme: Thesaurus Multirisque FORESTT
narrower: loss of savings
narrower: loss of assets
narrower: loss of ecosystem service
preferred label: perte économique du propriétaire forestier @fr
was quoted from: Groupe de travail « Thésaurus du multirisque en forêt » du projet X-RISKS du PEPR FORESTT (ANR-24-PEFO-0005). [En ligne]. <URL : https://www.pepr-forestt.fr/projets/pc-x-risks> @fr

diversify the company's markets
has status: Published
type: Concept
broader: response to protect the company
definition: Elargir le marché de l'entreprise forestière en développant de nouvelles offres pour les clients actuels, en étendant l’offre à de nouveaux clients, en contrôlant d'autres maillons de la chaine de valeur ou en explorant de nouveaux canaux de distribution. @fr
definition: Widen the forestry company's market by developing new offerings for existing customers, extending the offer to new customers, controlling other links in the value chain, or exploring new distribution channels.
in scheme: Thesaurus Multirisque FORESTT
preferred label: diversifier les débouchés de l'entreprise @fr
was quoted from: Adapté de Wise Guy Reports. Forestry and Logging Market. 2026. [En ligne]. Wise Guy Reports. [Consulté le 07/04/2026]. <URL : https://www.wiseguyreports.com/fr/reports/forestry-and-logging-market> @fr
was quoted from: Adapted from Wise Guy Reports. Forestry and Logging Market. 2026. [En ligne]. Wise Guy Reports. [Consulté le 07/04/2026]. <URL : https://www.wiseguyreports.com/fr/reports/forestry-and-logging-market>

hyperparameter
has status: Published
type: Concept
broader: risk measure
definition: Paramètre de réglage d'un modèle de prédiction de risque. @fr
definition: Tuning parameter of a risk prediction model.
in scheme: Thesaurus Multirisque FORESTT
narrower: risk level
preferred label: hyper-paramètre @fr
was quoted from: Adapté de wikipédia. [En ligne]. [Consulté le 20/02/2026]. <URL : https://fr.wikipedia.org/wiki/hyperparam%c3%a8tre>. @fr
was quoted from: Adapted from wikipédia. [En ligne]. [Consulté le 20/02/2026]. <URL : https://fr.wikipedia.org/wiki/hyperparam%c3%a8tre>.

dead branch retention
has status: Published
type: Concept
broader: stand structure
definition: Retention of dead branches on the tree trunk, increasing vertical fuel continuity.
definition: Maintien de branches mortes sur le tronc de l'arbre augmentant la continuité verticale du combustible. @fr
in scheme: Thesaurus Multirisque FORESTT
preferred label: rétention des branches mortes @fr
was quoted from: Adapté de Revertegat et al. (2025) Synthèse sur la vulnérabilité des peuplements forestiers au feu. Rapport final du projet AFORCE VULNEFEU (Vulnefeu04). [En ligne]. Réseau AFORCE, 2025. [Consulté le 25/03/2026]. <URL : https://www.reseau-aforce.fr/sites/reseau-aforce/files/2025-07/Rapport-Vulnefeu04-compressed.pdf @fr
was quoted from: Adapted from Revertegat et al. (2025) Synthèse sur la vulnérabilité des peuplements forestiers au feu. Rapport final du projet AFORCE VULNEFEU (Vulnefeu04). [En ligne]. Réseau AFORCE, 2025. [Consulté le 25/03/2026]. <URL : https://www.reseau-aforce.fr/sites/reseau-aforce/files/2025-07/Rapport-Vulnefeu04-compressed.pdf

rise in insurance premiums for forestry work companies
has status: Published
type: Concept
broader: vulnerability of forestry work companies
definition: Vulnérabilité des entreprises de travaux forestiers liée à la hausse de leurs primes d'assurance. @fr
definition: Vulnerability of forestry work companies related to the rise in their insurance premiums.
in scheme: Thesaurus Multirisque FORESTT
preferred label: augmentation de la prime d'assurance pour les entreprises de travaux forestiers @fr
was quoted from: Groupe de travail « Thésaurus du multirisque en forêt » du projet X-RISKS du PEPR FORESTT (ANR-24-PEFO-0005). [En ligne]. <URL : https://www.pepr-forestt.fr/projets/pc-x-risks> @fr

poor plantation quality
has status: Published
type: Concept
broader: poorly managed stand
definition: Plantation ne respectant pas les bonnes pratiques contribuant à la vulnérabilité du peuplement. @fr
definition: Plantation not complying with good practice, contributing to stand vulnerability.
in scheme: Thesaurus Multirisque FORESTT
preferred label: mauvaise qualité de la plantation @fr
was quoted from: Groupe de travail « Thésaurus du multirisque en forêt » du projet X-RISKS du PEPR FORESTT (ANR-24-PEFO-0005). [En ligne]. <URL : https://www.pepr-forestt.fr/projets/pc-x-risks> @fr

adaptive policy
has status: Published
type: Concept
broader: public policy
definition: Manière dont une politique peut être conçue et mise en œuvre afin d'offrir aux écosystèmes forestiers les meilleures chances possibles de faire face de manière adéquate à l'inconnu. @fr
definition: The way in which a policy can be designed and implemented in order to give forest ecosystems the best possible chance of adequately coping with the unknown.
in scheme: Thesaurus Multirisque FORESTT
preferred label: politique adaptative @fr
was quoted from: Adapté de Swanson et al. (2010) Sept outils pour créer des politiques adaptatives (Seven tools for creating adaptive policies). Technological Forecasting and Social Change, vol. 77, n° 6, pp. 924-939. [En ligne]. [Consulté le 25/03/2026]. <URL : https://www.sciencedirect.com/science/article/pii/S0040162510000727> @fr
was quoted from: Adapted from Swanson et al. (2010) Sept outils pour créer des politiques adaptatives (Seven tools for creating adaptive policies). Technological Forecasting and Social Change, vol. 77, n° 6, pp. 924-939. [En ligne]. [Consulté le 25/03/2026]. <URL : https://www.sciencedirect.com/science/article/pii/S0040162510000727>

demarcated zone with respect to pine wood nematode
has status: Published
type: Concept
broader: national emergency health intervention plan (PNISU) for Bursaphelenchus xylophilus (pine wood nematode)
definition: All municipalities containing infested zones and buffer zones subject to measures against the pine wood nematode.
definition: Ensemble des communes contenant des zones infestées et des zones tampons soumises à mesures contre le nématode du pin. @fr
in scheme: Thesaurus Multirisque FORESTT
preferred label: zone délimitée vis-à-vis du nématode du pin @fr
was quoted from: Adapté de Ministère de l’Agriculture. Instruction DGAL/SDQSPV/2019-209 (Plan national d’intervention sanitaire d’urgence - Nématode du pin). [En ligne]. 2019. [Consulté le 25/03/2026]. <URL : https://info.agriculture.gouv.fr/boagri/instruction-2019-209> @fr
was quoted from: Adapted from Ministère de l’Agriculture. Instruction DGAL/SDQSPV/2019-209 (Plan national d’intervention sanitaire d’urgence - Nématode du pin). [En ligne]. 2019. [Consulté le 25/03/2026]. <URL : https://info.agriculture.gouv.fr/boagri/instruction-2019-209>

forest overexploitation
has status: Published
type: Concept
broader: intensive silviculture
definition: Gestion forestière non durable qui ne garantit pas le renouvellement des ressources forestières. @fr
definition: Unsustainable forest management that does not guarantee the renewal of forest resources.
in scheme: Thesaurus Multirisque FORESTT
preferred label: surexploitation forestière @fr
was quoted from: Adapté de Académie d’Agriculture de France. Qu'entend-on par gestion forestière durable ? Peut-on la certifier ? 2016. [En ligne]. Académie d'Agriculture de France. [Consulté le 07/04/2026]. <URL : https://academie-agriculture.fr/sites/default/files/publications/encyclopedie/8.04.gestionfor.durable.v2.pdf> @fr
was quoted from: Adapted from Académie d’Agriculture de France. Qu'entend-on par gestion forestière durable ? Peut-on la certifier ? 2016. [En ligne]. Académie d'Agriculture de France. [Consulté le 07/04/2026]. <URL : https://academie-agriculture.fr/sites/default/files/publications/encyclopedie/8.04.gestionfor.durable.v2.pdf>

sensitivity related to topography
has status: Published
type: Concept
broader: sensitivity related to site conditions
definition: Extent to which a forest ecosystem is affected by a hazard due to its topographic position.
definition: Mesure dans laquelle un écosystème forestier est affecté par un aléa du fait de sa position topographique. @fr
in scheme: Thesaurus Multirisque FORESTT
narrower: frost pocket
preferred label: sensibilité liée à la topographie @fr
was quoted from: Adapted from CNPF. Plaquette sols. [En ligne]. [Consulté le 20/02/2026]. <URL : https://www.cnpf.fr/sites/socle/files/2024-07/plaquette_sols_cnpf.pdf>.
was quoted from: Adapté de CNPF. Plaquette sols. [En ligne]. [Consulté le 20/02/2026]. <URL : https://www.cnpf.fr/sites/socle/files/2024-07/plaquette_sols_cnpf.pdf>. @fr

biodiversity erosion
has status: Published
type: Concept
broader: loss of supporting ecosystem service
definition: Diminution de la diversité des organismes vivants de toutes origines, ainsi que des complexes écologiques dont ils font partie. @fr
definition: Decrease in the diversity of living organisms of all origins, as well as the ecological complexes of which they are part.
in scheme: Thesaurus Multirisque FORESTT
preferred label: érosion de la biodiversité @fr
was quoted from: Adapté de Millennium Ecosystem Assessment (2005) Ecosystems and Human Well-being. En ligne]. Millennium Ecosystem Assessment. [Consulté le 01/04/2026]. <URL : https://www.millenniumassessment.org/documents/document.765.aspx.pdf> @fr
was quoted from: Adapted from Millennium Ecosystem Assessment (2005) Ecosystems and Human Well-being. En ligne]. Millennium Ecosystem Assessment. [Consulté le 01/04/2026]. <URL : https://www.millenniumassessment.org/documents/document.765.aspx.pdf>

income loss
has status: Published
type: Concept
broader: damage characterisation
definition: Decrease in forest-related income.
definition: Diminution du revenu lié à la forêt. @fr
in scheme: Thesaurus Multirisque FORESTT
preferred label: perte de revenu @fr
was quoted from: Groupe de travail « Thésaurus du multirisque en forêt » du projet X-RISKS du PEPR FORESTT (ANR-24-PEFO-0005). [En ligne]. <URL : https://www.pepr-forestt.fr/projets/pc-x-risks> @fr

loss of savings
has status: Published
type: Concept
broader: economic loss for the forest owner
definition: Diminution de l’épargne d'un propriétaire forestier. @fr
definition: Decrease in a forest owner's savings.
in scheme: Thesaurus Multirisque FORESTT
preferred label: perte en épargne @fr
was quoted from: Groupe de travail « Thésaurus du multirisque en forêt » du projet X-RISKS du PEPR FORESTT (ANR-24-PEFO-0005). [En ligne]. <URL : https://www.pepr-forestt.fr/projets/pc-x-risks> @fr

skeletoniser
has status: Published
type: Concept
broader: foliage pest insect
definition: Organism feeding only on the surface layer of leaves without touching the veins, giving them a skeletal appearance.
definition: Organisme se nourrissant uniquement de la couche superficielle des feuilles sans toucher les nervures, lui conférant un aspect squelettique. @fr
in scheme: Thesaurus Multirisque FORESTT
preferred label: squeletteuse @fr
was quoted from: SCF RNCan. Termes. [En ligne]. Ottawa, SCF RNCan. [Consulté le 20/02/2026]. <URL : https://scf.rncan.gc.ca/termes>.

containment
has status: Published
type: Concept
alternative label: limitation propagation @fr
alternative label: spread limitation
broader: curative management, direct control
definition: Application de mesures phytosanitaires dans ou autour d’une zone infestée afin de prévenir la dissémination d’un organisme nuisible. @fr
definition: Application of phytosanitary measures in or around an infested area in order to prevent the spread of a harmful organism.
in scheme: Thesaurus Multirisque FORESTT
narrower: wood transport ban
preferred label: enrayement @fr
was quoted from: Adapté de FAO - CIPV. Glossaire des termes phytosanitaires. Norme internationale pour les mesures phytosanitaires N° 5 (NIMP 5). FAO, 2023. [En ligne]. [Consulté le 25/03/2026]. <URL : https://openknowledge.fao.org/server/api/core/bitstreams/9c624f74-fb37-45c1-aff5-9a05f3dc1fc9/content> @fr
was quoted from: Adapted from FAO - CIPV. Glossaire des termes phytosanitaires. Norme internationale pour les mesures phytosanitaires N° 5 (NIMP 5). FAO, 2023. [En ligne]. [Consulté le 25/03/2026]. <URL : https://openknowledge.fao.org/server/api/core/bitstreams/9c624f74-fb37-45c1-aff5-9a05f3dc1fc9/content>

pine wood nematode vector insect
has status: Published
type: Concept
broader: vector insect
definition: Coléoptère du genre Monochamus transmettant le nématode du pin. @fr
definition: Beetle of the genus Monochamus transmitting the pine wood nematode.
in scheme: Thesaurus Multirisque FORESTT
preferred label: insecte vecteur de nématode du pin @fr

sensitivity related to site conditions
has status: Published
type: Concept
broader: sensitivity related to soil-climate conditions
definition: Mesure dans laquelle un écosystème forestier est affecté par un aléa du fait des caractéristiques locales du site. @fr
definition: Extent to which a forest ecosystem is affected by a hazard due to local site characteristics.
in scheme: Thesaurus Multirisque FORESTT
narrower: sensitivity related to topography
narrower: sensitivity related to water conditions
narrower: weather characteristic
preferred label: sensibilité liée aux conditions stationnelles @fr
was quoted from: Adapted from CNPF. Plaquette sols. [En ligne]. [Consulté le 20/02/2026]. <URL : https://www.cnpf.fr/sites/socle/files/2024-07/plaquette_sols_cnpf.pdf>.
was quoted from: Adapté de CNPF. Plaquette sols. [En ligne]. [Consulté le 20/02/2026]. <URL : https://www.cnpf.fr/sites/socle/files/2024-07/plaquette_sols_cnpf.pdf>. @fr

eradication
has status: Published
type: Concept
broader: curative management, direct control
definition: Application of phytosanitary measures in order to eliminate a harmful organism from an area.
definition: Application de mesures phytosanitaires afin d’éliminer un organisme nuisible d’une zone. @fr
in scheme: Thesaurus Multirisque FORESTT
preferred label: éradication @fr
was quoted from: Adapté de FAO - CIPV. Glossaire des termes phytosanitaires. Norme internationale pour les mesures phytosanitaires N° 5 (NIMP 5). FAO, 2023. [En ligne]. [Consulté le 25/03/2026]. <URL : https://openknowledge.fao.org/server/api/core/bitstreams/9c624f74-fb37-45c1-aff5-9a05f3dc1fc9/content> @fr
was quoted from: Adapted from FAO - CIPV. Glossaire des termes phytosanitaires. Norme internationale pour les mesures phytosanitaires N° 5 (NIMP 5). FAO, 2023. [En ligne]. [Consulté le 25/03/2026]. <URL : https://openknowledge.fao.org/server/api/core/bitstreams/9c624f74-fb37-45c1-aff5-9a05f3dc1fc9/content>

semiochemical treatment
has status: Published
type: Concept
broader: curative management, direct control
definition: Utilisation des médiateurs chimiques utilisés par les insectes pour communiquer (phéromones ou composés allélochimiques) dans des pièges pour lutter contre les insectes ravageurs des forêts. @fr
definition: Use of chemical mediators used by insects to communicate (pheromones or allelochemical compounds) in traps to control forest pest insects.
in scheme: Thesaurus Multirisque FORESTT
narrower: use of attractants
narrower: use of repellents
preferred label: traitement sémiochimique @fr
was quoted from: Adapté de Regnault-Roger (2017) Les composés sémiochimiques : facteurs incontournables du biocontrôle. Présentation du 1er février 2017. Académie d’Agriculture de France, 2017. [En ligne]. [Consulté le 25/03/2026]. <URL : https://www.academie-agriculture.fr/system/files_force/seances-colloques/20170201presentation1.pdf> @fr
was quoted from: Adapted from Regnault-Roger (2017) Les composés sémiochimiques : facteurs incontournables du biocontrôle. Présentation du 1er février 2017. Académie d’Agriculture de France, 2017. [En ligne]. [Consulté le 25/03/2026]. <URL : https://www.academie-agriculture.fr/system/files_force/seances-colloques/20170201presentation1.pdf>

designated establishment with respect to the nematode
has status: Published
type: Concept
broader: regulatory measure
definition: Establishment approved for treatment against the nematode.
definition: Établissement agréé pour le traitement contre le nématode. @fr
in scheme: Thesaurus Multirisque FORESTT
preferred label: établissement désigné vis-à-vis du nématode @fr
was quoted from: Adapté de Plan national d'intervention sanitaire d'urgence relatif à Bursaphelenchus xylophilus (nématode du pin). [En ligne]. [Consulté le 20/02/2026]. <URL : https://info.agriculture.gouv.fr/boagri/instruction-2019-209>. @fr
was quoted from: Adapted from Plan national d'intervention sanitaire d'urgence relatif à Bursaphelenchus xylophilus (nématode du pin). [En ligne]. [Consulté le 20/02/2026]. <URL : https://info.agriculture.gouv.fr/boagri/instruction-2019-209>.

worst-case risk
has status: Published
type: Concept
broader: qualitative risk assessment
definition: Niveau le plus élevé pour un risque considéré, avec des conséquences potentiellement dévastatrices. @fr
definition: Highest level for a given risk, with potentially devastating consequences.
in scheme: Thesaurus Multirisque FORESTT
preferred label: pire risque @fr
was quoted from: Adapté de Vaysse (2019) Méthodes de détermination du danger météorologique d’incendie dans le sud de la France. Forêt méditerranéenne, XL(2), pp. 193-200. [En ligne]. [Consulté le 25/03/2026]. <URL : https://www.foret-mediterraneenne.org/upload/biblio/FORET_MED_2019_2_193-200.pdf> @fr
was quoted from: Adapted from Vaysse (2019) Méthodes de détermination du danger météorologique d’incendie dans le sud de la France. Forêt méditerranéenne, XL(2), pp. 193-200. [En ligne]. [Consulté le 25/03/2026]. <URL : https://www.foret-mediterraneenne.org/upload/biblio/FORET_MED_2019_2_193-200.pdf>

risk transfer
has status: Published
type: Concept
broader: forest insurance
definition: Processus consistant à transférer les conséquences financières de risques particuliers d'une partie à une autre via le mécanisme d'assurance. @fr
definition: Process of transferring the financial consequences of particular risks from one party to another through the insurance mechanism.
in scheme: Thesaurus Multirisque FORESTT
preferred label: transfert de risque @fr
was quoted from: Adapté de PreventionWeb. Insurance and risk transfer. [En ligne]. Knowledge Base - Thème « State, government and economy ». [Consulté le 25/03/2026]. <URL : https://www.preventionweb.net/knowledge-base/themes/state-governance-and-economy/insurance-and-risk-transfer> @fr
was quoted from: Adapted from PreventionWeb. Insurance and risk transfer. [En ligne]. Knowledge Base - Thème « State, government and economy ». [Consulté le 25/03/2026]. <URL : https://www.preventionweb.net/knowledge-base/themes/state-governance-and-economy/insurance-and-risk-transfer>

hypoxia
type: Concept
broader: near-surface water table depth
definition: Déficit en oxygène subi par les racines situées en sol engorgé. @fr
definition: Oxygen deficit experienced by roots located in waterlogged soil.
in scheme: Thesaurus Multirisque FORESTT
preferred label: hypoxie @fr
was quoted from: Adapté de Bréda (2023). Vulnérabilité, aléa, adaptation, résilience. [En ligne]. [Consulté le 20/02/2026]. <URL : https://revueforestierefrancaise.agroparistech.fr/article/view/7585>. @fr
was quoted from: Adapted from Bréda (2023). Vulnérabilité, aléa, adaptation, résilience. [En ligne]. [Consulté le 20/02/2026]. <URL : https://revueforestierefrancaise.agroparistech.fr/article/view/7585>.

cavitation
has status: Published
type: Concept
broader: damage characterisation
definition: Formation of air bubbles blocking sap flow in tree vessels.
definition: Formation de bulles d’air bloquant la circulation de la sève dans les vaisseaux des arbres. @fr
in scheme: Thesaurus Multirisque FORESTT
was quoted from: Adapted from Courbet et al. (2022). Forêts et changement climatique : Comprendre et modéliser le fonctionnement hydrique des arbres. Éditions Quae, 2022, 144 p.
was quoted from: Adapté de Courbet et al. (2022). Forêts et changement climatique : Comprendre et modéliser le fonctionnement hydrique des arbres. Éditions Quae, 2022, 144 p. @fr

wind erosion of soils
has status: Published
type: Concept
broader: soil erosion
definition: Détachement et transport par le vent de particules de sol et de roche. @fr
definition: Detachment and transport of soil and rock particles by wind.
in scheme: Thesaurus Multirisque FORESTT
preferred label: érosion des sols par le vent @fr
was quoted from: Adapté de Eaufrance. L’érosion. [En ligne]. [Consulté le 20/02/2026]. <URL : https://www.eaufrance.fr/lerosion>. @fr
was quoted from: Adapted from Eaufrance. L’érosion. [En ligne]. [Consulté le 20/02/2026]. <URL : https://www.eaufrance.fr/lerosion>.

outbreak focus
has status: Published
type: Concept
broader: hazard characterisation
definition: Point de départ d’une infectation par un organisme nuisible. @fr
definition: Starting point of an infestation by a harmful organism.
in scheme: Thesaurus Multirisque FORESTT
narrower: suspected outbreak
narrower: outbreak confirmation
preferred label: foyer @fr
was quoted from: Adapté de Plan national d'intervention sanitaire d'urgence relatif à Bursaphelenchus xylophilus (nématode du pin). [En ligne]. [Consulté le 20/02/2026]. <URL : https://info.agriculture.gouv.fr/boagri/instruction-2019-209>. @fr
was quoted from: Adapted from Plan national d'intervention sanitaire d'urgence relatif à Bursaphelenchus xylophilus (nématode du pin). [En ligne]. [Consulté le 20/02/2026]. <URL : https://info.agriculture.gouv.fr/boagri/instruction-2019-209>.

pathogen prevalence
has status: Published
type: Concept
alternative label: prévalence de la maladie @fr
alternative label: disease prevalence
broader: prevalence
definition: Infection rate by a pathogen in a stand.
definition: Taux d’infection par un pathogène dans un peuplement. @fr
in scheme: Thesaurus Multirisque FORESTT
preferred label: prévalence du pathogène @fr
was quoted from: Adapté de Géoconfluences. Prévalence. [En ligne]. [Consulté le 13/03/2026]. <URL : https://geoconfluences.ens-lyon.fr/glossaire/prevalence> @fr
was quoted from: Adapted from Géoconfluences. Prévalence. [En ligne]. [Consulté le 13/03/2026]. <URL : https://geoconfluences.ens-lyon.fr/glossaire/prevalence>

water point network
has status: Published
type: Concept
broader: adapt forest infrastructure
definition: All the water supply points for forest firefighting, including tanks, reservoirs and fire hydrants.
definition: Ensemble des points de ravitaillement en eau pour la lutte contre les incendies de forêt comprenant les citernes, retenues et poteaux incendie. @fr
in scheme: Thesaurus Multirisque FORESTT
preferred label: réseau de points d’eau @fr
was quoted from: Adapted from Rigolot & Costa (coord.) (2000) Conception des coupures de combustible. Réseau Coupures de combustible RCC n°4, 2000. [En ligne]. Éditions de la Cardère. [Consulté le 01/04/2026]. <URL : https://cardere.fr/doc/RCC4.pdf>
was quoted from: Adapté de Rigolot & Costa (coord.) (2000) Conception des coupures de combustible. Réseau Coupures de combustible RCC n°4, 2000. [En ligne]. Éditions de la Cardère. [Consulté le 01/04/2026]. <URL : https://cardere.fr/doc/RCC4.pdf> @fr

loss of cultural ecosystem service
has status: Published
type: Concept
broader: damage characterisation
definition: Reduction in the cultural service provided by forest ecosystems, such as recreational use or the aesthetic value of the landscape.
definition: Réduction du service culturel fourni par les écosystèmes forestiers tel que l'accueil ou la valeur esthétique du paysage. @fr
in scheme: Thesaurus Multirisque FORESTT
narrower: loss of emblematic genetic resources
narrower: restriction of recreational hunting
narrower: decline in forest recreational use
narrower: landscape depreciation
preferred label: perte de service écosystémique culturel @fr
was quoted from: Adapté de Millennium Ecosystem Assessment (2005) Ecosystems and Human Well-being. En ligne]. Millennium Ecosystem Assessment. [Consulté le 01/04/2026]. <URL : https://www.millenniumassessment.org/documents/document.765.aspx.pdf> @fr
was quoted from: Adapted from Millennium Ecosystem Assessment (2005) Ecosystems and Human Well-being. En ligne]. Millennium Ecosystem Assessment. [Consulté le 01/04/2026]. <URL : https://www.millenniumassessment.org/documents/document.765.aspx.pdf>

species composition
has status: Published
type: Concept
broader: sensitivity related to species composition
definition: Ensemble des espèces végétales présentes dans un lieu donné. @fr
definition: All the plant species present in a given location.
in scheme: Thesaurus Multirisque FORESTT
preferred label: composition en espèce @fr
was quoted from: FAO. Agrovoc - Composition en espèces. [En ligne]. Rome, FAO. [Consulté le 20/02/2026]. <URL : https://agrovoc.fao.org/browse/agrovoc/fr/page/c_15945>. @fr

accumulation of weather hazards
has status: Published
type: Concept
broader: vulnerability of forestry work companies
definition: Vulnérabilité des entreprises de travaux forestiers liée à l'accumulation des aléas météorologiques perturbant leur activité. @fr
definition: Vulnerability of forestry work companies related to the accumulation of weather hazards disrupting their activity.
in scheme: Thesaurus Multirisque FORESTT
preferred label: accumulation des aléas météo @fr
was quoted from: Groupe de travail « Thésaurus du multirisque en forêt » du projet X-RISKS du PEPR FORESTT (ANR-24-PEFO-0005). [En ligne]. <URL : https://www.pepr-forestt.fr/projets/pc-x-risks> @fr

sensitivity related to cambial phenology
has status: Published
type: Concept
broader: sensitivity related to phenology
definition: Mesure dans laquelle une espèce forestière est affectée par un aléa du fait de son activité cambiale. @fr
definition: Extent to which a forest species is affected by a hazard due to its cambial activity.
in scheme: Thesaurus Multirisque FORESTT
preferred label: sensibilité liée à la phénologie cambiale @fr
was quoted from: Adapté de TEMPO. Observatoire Forêts. [En ligne]. TEMPO (Réseau national d’observation de la phénologie). [Consulté le 25/03/2026]. <URL : https://tempo.pheno.fr/observatoires/observatoire-forets> @fr
was quoted from: Adapted from TEMPO. Observatoire Forêts. [En ligne]. TEMPO (Réseau national d’observation de la phénologie). [Consulté le 25/03/2026]. <URL : https://tempo.pheno.fr/observatoires/observatoire-forets>

insolvency filing
has status: Published
type: Concept
alternative label: cessation des paiements @fr
broader: economic loss for the company
definition: Legal procedure for declaring the cessation of payments of a forest-wood sector company.
definition: Procédure légale de déclaration de cessation des paiements d’une entreprise de la filière forêt-bois. @fr
in scheme: Thesaurus Multirisque FORESTT
preferred label: dépôt de bilan @fr
was quoted from: Groupe de travail « Thésaurus du multirisque en forêt » du projet X-RISKS du PEPR FORESTT (ANR-24-PEFO-0005). [En ligne]. <URL : https://www.pepr-forestt.fr/projets/pc-x-risks> @fr

non-chemical insecticide treatment
has status: Published
type: Concept
broader: insecticide treatment
definition: Application d'une préparation biologique servant à tuer ou à perturber le développement des insectes ravageurs des forêts. @fr
definition: Application of a biological preparation used to kill or disrupt the development of forest pest insects.
in scheme: Thesaurus Multirisque FORESTT
preferred label: traitement insecticide non-chimique @fr
was quoted from: Adapté de RNCan - Service canadien des forêts. Glossaire forestier : Sylviculture intensive. [En ligne]. 2019. [Consulté le 25/03/2026]. <URL : https://scf.rncan.gc.ca/termes/vue/710> @fr
was quoted from: Adapted from RNCan - Service canadien des forêts. Glossaire forestier : Sylviculture intensive. [En ligne]. 2019. [Consulté le 25/03/2026]. <URL : https://scf.rncan.gc.ca/termes/vue/710>

use of attractants
has status: Published
type: Concept
alternative label: piégeage de masse @fr
alternative label: mass trapping
broader: semiochemical treatment
definition: Utilisation pour le piégeage d'un stimulus chimique ou visuel qui incite un insecte ravageur des forêts à se diriger vers la source. @fr
definition: Use, for trapping purposes, of a chemical or visual stimulus that entices a forest pest insect to move towards the source.
in scheme: Thesaurus Multirisque FORESTT
narrower: pheromone trap
narrower: insecticide trap
preferred label: utilisation d'attractifs @fr
was quoted from: Adapté de AGROVOC. Attractif. [En ligne]. FAO. [Consulté le 25/03/2026]. <URL : https://agrovoc.fao.org/browse/agrovoc/fr/page/c_705> @fr
was quoted from: Adapted from AGROVOC. Attractif. [En ligne]. FAO. [Consulté le 25/03/2026]. <URL : https://agrovoc.fao.org/browse/agrovoc/fr/page/c_705>

rise in wood prices
has status: Published
type: Concept
broader: standing timber price instability
definition: Augmentation brutale du prix du bois. @fr
definition: Sudden increase in the price of wood.
in scheme: Thesaurus Multirisque FORESTT
preferred label: hausse du prix du bois @fr
was quoted from: Adapté de Forestopic. Le prix du bois sur pied fait une remontada. [En ligne]. Forestopic. [Consulté le 07/04/2026]. <URL : https://www.forestopic.com/fr/foret/economie/1893-prix-bois-sur-pied-remontada?highlight=WyJwcml4Il0=> @fr
was quoted from: Adapted from Forestopic. Le prix du bois sur pied fait une remontada. [En ligne]. Forestopic. [Consulté le 07/04/2026]. <URL : https://www.forestopic.com/fr/foret/economie/1893-prix-bois-sur-pied-remontada?highlight=WyJwcml4Il0=>

transport assistance
has status: Published
type: Concept
broader: reconstitution plan
definition: Aide au transport des bois de crise. @fr
definition: Assistance for transporting crisis timber.
in scheme: Thesaurus Multirisque FORESTT
preferred label: aide au transport @fr
was quoted from: Adapté de Ayphassorho et al. (2025) Valorisation des bois de crise et résilience de la filière forêt-bois : Vers une culture du risque. Rapport CGAAER n° 24073 - IGEDD n° 015817-01. IGEDD / CGAAER, 2025, 166 p. [En ligne]. [Consulté le 25/03/2026]. <URL : https://www.igedd.developpement-durable.gouv.fr/IMG/pdf/015817-01_rapport_publie_cle5431ce.pdf> @fr
was quoted from: Adapted from Ayphassorho et al. (2025) Valorisation des bois de crise et résilience de la filière forêt-bois : Vers une culture du risque. Rapport CGAAER n° 24073 - IGEDD n° 015817-01. IGEDD / CGAAER, 2025, 166 p. [En ligne]. [Consulté le 25/03/2026]. <URL : https://www.igedd.developpement-durable.gouv.fr/IMG/pdf/015817-01_rapport_publie_cle5431ce.pdf>

vulnerability of owners
has status: Published
type: Concept
broader: vulnerability of the wood sector
definition: Propensity or predisposition of forest owners to suffer losses. A notion encompassing various concepts and elements, such as sensitivity or fragility and the inability to cope and adapt.
definition: Propension ou prédisposition des propriétaires forestiers à subir des pertes. Notion englobant divers concepts et éléments, tels que la sensibilité ou la fragilité et l’incapacité de faire face et de s’adapter. @fr
in scheme: Thesaurus Multirisque FORESTT
narrower: socio-economic profile of the owner
narrower: weakening of owners' savings
narrower: owners' dependence on forestry income
narrower: rise in insurance premiums for owners
preferred label: vulnérabilité des propriétaires @fr
was quoted from: Adapté de GIEC (2018) Glossaire. Rapport spécial sur les conséquences d’un réchauffement planétaire de 1,5 °C. [En ligne]. Genève, GIEC. [Consulté le 20/02/2026]. <URL : https://www.ipcc.ch/site/assets/uploads/sites/2/2019/10/SR15_Glossary_french.pdf>. @fr
was quoted from: Adapted from GIEC (2018) Glossaire. Rapport spécial sur les conséquences d’un réchauffement planétaire de 1,5 °C. [En ligne]. Genève, GIEC. [Consulté le 20/02/2026]. <URL : https://www.ipcc.ch/site/assets/uploads/sites/2/2019/10/SR15_Glossary_french.pdf>.

leaf desiccation
has status: Published
type: Concept
broader: damage characterisation
definition: Flétrissement et dessèchement, perte de forme et de couleur des feuille dus à un manque d'eau ou à des toxines produites par les champignons. @fr
definition: Wilting and drying, loss of shape and colour of leaves due to lack of water or toxins produced by fungi.
in scheme: Thesaurus Multirisque FORESTT
preferred label: dessèchement des feuilles @fr
was quoted from: Adapté de Lebrun (1963). Déshydratation foliaire chez les Coffea. Bulletins de l’Académie Royale de Belgique, 49(1), pp. 684-696. @fr
was quoted from: Adapted from Lebrun (1963). Déshydratation foliaire chez les Coffea. Bulletins de l’Académie Royale de Belgique, 49(1), pp. 684-696.

exposure
has status: Published
type: Concept
broader: risk component
definition: Présence de personnes, de moyens de subsistance, d’espèces ou d’écosystèmes, de fonctions, ressources ou services environnementaux, d’éléments d’infrastructure ou de biens économiques, sociaux ou culturels dans un lieu ou dans un cadre susceptible de subir des dommages @fr
definition: The presence of people, livelihoods, species or ecosystems, environmental functions, resources or services, infrastructure elements, or economic, social or cultural assets in a place or setting that could be adversely affected.
in scheme: Thesaurus Multirisque FORESTT
preferred label: exposition @fr
was quoted from: GIEC (2018). Glossaire. [En ligne]. Genève, GIEC. [Consulté le 20/02/2026]. <URL : https://www.ipcc.ch/site/assets/uploads/sites/2/2019/10/SR15_Glossary_french.pdf>. @fr

human health
has status: Published
type: Concept
alternative label: enjeu sanitaire @fr
alternative label: health asset
broader: human asset at risk
definition: Person exposed to a forest hazard whose health is threatened.
definition: Personne exposée à un aléa de la forêt dont la santé est menacée. @fr
in scheme: Thesaurus Multirisque FORESTT
preferred label: santé humaine @fr
was quoted from: Adapté de GIEC (2018) Glossaire. [En ligne]. Genève, GIEC. [Consulté le 20/02/2026]. <URL : https://www.ipcc.ch/site/assets/uploads/sites/2/2019/10/SR15_Glossary_french.pdf>. @fr
was quoted from: Adapted from GIEC (2018) Glossaire. [En ligne]. Genève, GIEC. [Consulté le 20/02/2026]. <URL : https://www.ipcc.ch/site/assets/uploads/sites/2/2019/10/SR15_Glossary_french.pdf>.

lightning damage
has status: Published
type: Concept
broader: damage characterisation
definition: Dommage causé par l'impact de la foudre sur un arbre. @fr
definition: Damage caused by a lightning strike on a tree.
in scheme: Thesaurus Multirisque FORESTT
preferred label: dégât de foudre @fr
was quoted from: Adapté de e-phytia - INRAE. Forêts - Foudre. [En ligne]. INRAE, Département de la Santé des Forêts. [Consulté le 25/03/2026]. <URL : https://ephytia.inrae.fr/fr/C/18541/Forets-Foudre> @fr
was quoted from: Adapted from e-phytia - INRAE. Forêts - Foudre. [En ligne]. INRAE, Département de la Santé des Forêts. [Consulté le 25/03/2026]. <URL : https://ephytia.inrae.fr/fr/C/18541/Forets-Foudre>

genetic enrichment
has status: Published
type: Concept
alternative label: flux de gènes assistés @fr
alternative label: assisted gene flow
broader: genotype mixing through planting
definition: Démarche d'amélioration génétique visant à augmenter la diversité génétique d'un arbre, afin de le rendre plus résistant aux aléas. @fr
definition: Genetic improvement approach aiming to increase the genetic diversity of a tree, in order to make it more resistant to hazards.
in scheme: Thesaurus Multirisque FORESTT
preferred label: enrichissement génétique @fr
was quoted from: Adapté de RNCan - Service canadien des forêts. Glossaire forestier : Sylviculture intensive. [En ligne]. 2019. [Consulté le 25/03/2026]. <URL : https://scf.rncan.gc.ca/termes/vue/635> @fr
was quoted from: Adapted from RNCan - Service canadien des forêts. Glossaire forestier : Sylviculture intensive. [En ligne]. 2019. [Consulté le 25/03/2026]. <URL : https://scf.rncan.gc.ca/termes/vue/635>

short-time working
has status: Published
type: Concept
alternative label: activité partielle @fr
broader: economic loss for the company
definition: Dispositif de réduction temporaire de l'activité d'une entreprise de la filière bois permettant de maintenir les effectifs et de réduire les charges. @fr
definition: Mechanism for temporarily reducing the activity of a wood sector company, allowing staffing levels to be maintained and costs to be reduced.
in scheme: Thesaurus Multirisque FORESTT
preferred label: chomage technique @fr
was quoted from: Adapté de L-Expert-Comptable.com. Chômage technique : définition, conditions et indemnisation. [En ligne]. [Consulté le 04/08/2026]. <URL : https://www.l-expert-comptable.com/a/532661-chomage-technique-definition-conditions-et-indemnisation.html> @fr
was quoted from: Adapted from L-Expert-Comptable.com. Chômage technique : définition, conditions et indemnisation. [En ligne]. [Consulté le 04/08/2026]. <URL : https://www.l-expert-comptable.com/a/532661-chomage-technique-definition-conditions-et-indemnisation.html>

damage measure
has status: Published
type: Concept
broader: value exposed to risk
definition: Evaluation quantitative des pertes liés aux impacts (observés) ou aux risques (projetés). @fr
definition: Quantitative assessment of losses linked to (observed) impacts or (projected) risks.
in scheme: Thesaurus Multirisque FORESTT
preferred label: mesure de dommage @fr
was quoted from: Adapté de GIEC. (2018). Glossaire. [En ligne]. Genève, GIEC. [Consulté le 20/02/2026]. <URL : https://www.ipcc.ch/site/assets/uploads/sites/2/2019/10/SR15_Glossary_french.pdf>. @fr
was quoted from: Adapted from GIEC. (2018). Glossaire. [En ligne]. Genève, GIEC. [Consulté le 20/02/2026]. <URL : https://www.ipcc.ch/site/assets/uploads/sites/2/2019/10/SR15_Glossary_french.pdf>.

filière bois
type: Collection
in scheme: Thesaurus Multirisque FORESTT
member: risk to the wood sector
member: exposed asset of the wood sector
member: exposed actor of the forest-wood sector
member: loss for the wood sector
member: hazard threatening the wood industry
member: vulnerability of the wood sector
member: response to protect the wood sector
member: exposed actor of primary processing
member: exposed actor of secondary processing
member: exposed forest manager
member: exposed forest owner
member: exposed forestry work contractor
member: exposed forest operator
member: economic loss
member: difficulty for forestry work companies in negotiating fair prices
member: vulnerability of forestry work companies
member: irregular workload for forestry work companies
member: recruitment difficulty for forestry work companies
member: rise in insurance premiums for forestry work companies
member: cash flow difficulty for forestry work companies
member: accumulation of weather hazards
member: environmental regulation applying to forestry work companies
member: workplace accident
member: excessive specialisation of forestry work companies
member: redundancy
member: short-time working
member: economic loss for the company
member: depreciation of wood value
member: non-compliance with the wood use hierarchy
member: insolvency filing
member: standing timber price instability
member: drop in timber prices
member: market instability
member: rise in wood prices
member: economic hazard
member: instability of processed product prices
member: actor failure
member: decline in financial support
member: pressure on the wood resource
member: social hazard
member: political hazard
member: environmental hazard
member: downstream actor failure
member: upstream actor failure
member: wood shortage
member: societal and organisational vulnerability
member: lack of risk culture
member: inter-service competition
member: vulnerability of owners
member: vulnerability of processing actors
member: inability to manage crisis timber
member: vulnerability of silvicultural management models
member: vulnerability of support services
member: loss of crisis memory
member: loss of local knowledge
member: economic loss for the forest owner
member: loss of economic viability of the company
member: loss of savings
member: loss of assets
member: loss of ecosystem service
member: loss of recreational services
member: loss of non-wood products
member: response to protect the company
member: reconstitution plan
member: structural assistance
member: response to protect the owner
member: risk prevention plan
member: crisis management plan
member: diversify the company's supply sources
member: diversify the company's markets
member: increase the company's cash flow
member: reconstitution assistance
member: cleanup assistance
member: storage assistance
member: transport assistance
member: DEFI scheme
member: modernisation plan for processing industries
member: adapt the owner's risk management and prevention practices

multiple risks
has status: Published
type: Concept
definition: Prise en compte globale de tous les risques au sein d'un système donné, sans tenir compte des interactions entre les dangers et/ou les enjeux sociaux et environnementaux. @fr
definition: Comprehensive consideration of all risks within a given system, without taking into account the interactions between hazards and/or social and environmental assets.
in scheme: Thesaurus Multirisque FORESTT
narrower: multiple vulnerabilities
narrower: multiple hazards
narrower: cumulative damage
narrower: simultaneous risks
preferred label: risques multiples @fr
top concept of: Thesaurus Multirisque FORESTT
was quoted from: Groupe de travail « Thésaurus du multirisque en forêt » du projet X-RISKS du PEPR FORESTT (ANR-24-PEFO-0005). [En ligne]. <URL : https://www.pepr-forestt.fr/projets/pc-x-risks> @fr

priority quarantine organism
has status: Published
type: Concept
broader: quarantine organism
definition: Organisme de quarantaine identifié comme constituant une priorité absolue pour les États membres de l’UE en fonction de la gravité des problèmes économiques, sociaux ou environnementaux qu'il est susceptible d’engendrer. @fr
definition: Quarantine organism identified as an absolute priority for EU member states based on the severity of the economic, social or environmental problems it is likely to cause.
in scheme: Thesaurus Multirisque FORESTT
preferred label: organisme de quarantaine prioritaire @fr
was quoted from: Adapté de Ministère de l’Agriculture. Instruction DGAL/SDQSPV/2019-209 (Plan national d’intervention sanitaire d’urgence - Nématode du pin). [En ligne]. 2019. [Consulté le 25/03/2026]. <URL : https://info.agriculture.gouv.fr/boagri/instruction-2019-209> @fr
was quoted from: Adapted from Ministère de l’Agriculture. Instruction DGAL/SDQSPV/2019-209 (Plan national d’intervention sanitaire d’urgence - Nématode du pin). [En ligne]. 2019. [Consulté le 25/03/2026]. <URL : https://info.agriculture.gouv.fr/boagri/instruction-2019-209>

fertilisation
has status: Published
type: Concept
broader: silvicultural action
definition: Ensemble des techniques consistant à amender le sol dans le but d’en augmenter la fertilité, notamment au moyen d’engrais chimiques ou organiques. @fr
definition: All techniques consisting of amending the soil in order to increase its fertility, in particular by means of chemical or organic fertilisers.
in scheme: Thesaurus Multirisque FORESTT
was quoted from: Adapté de RNCan - Service canadien des forêts. Glossaire forestier : Sylviculture intensive. [En ligne]. 2019. [Consulté le 25/03/2026]. <URL : https://scf.rncan.gc.ca/termes/vue/570> @fr
was quoted from: Adapted from RNCan - Service canadien des forêts. Glossaire forestier : Sylviculture intensive. [En ligne]. 2019. [Consulté le 25/03/2026]. <URL : https://scf.rncan.gc.ca/termes/vue/570>

bringing owners closer to advisory structures
has status: Published
type: Concept
broader: response to protect the owner
definition: Strengthening of technical and administrative support for forest owners to reduce their vulnerability to risks.
definition: Renforcement de l'accompagnement technique et adminsitratif des propriétaires forestiers pour diminuer leur vulnérabilité aux risques. @fr
in scheme: Thesaurus Multirisque FORESTT
preferred label: rapprochement du propriétaire des structures de conseils @fr
was quoted from: Adapted from CNPF. Renforcer le conseil forestier en Europe : un projet ambitieux démarre !. 2025. [En ligne]. Centre national de la propriété forestière. [Consulté le 07/04/2026]. <URL : https://www.cnpf.fr/actualites/renforcer-le-conseil-forestier-en-europe-un-projet-ambitieux-demarre>
was quoted from: Adapté de CNPF. Renforcer le conseil forestier en Europe : un projet ambitieux démarre !. 2025. [En ligne]. Centre national de la propriété forestière. [Consulté le 07/04/2026]. <URL : https://www.cnpf.fr/actualites/renforcer-le-conseil-forestier-en-europe-un-projet-ambitieux-demarre> @fr

self-protection of forest stands
has status: Published
type: Concept
broader: silvicultural action
definition: Fuel break intended to reduce the effects of fire passage on a forest stand by ensuring the survival of the majority of trees.
definition: Coupure de combustible destinée à réduire les effets du passage du feu sur un peuplement forestier en garantissant la survie de la majorité des arbres. @fr
in scheme: Thesaurus Multirisque FORESTT
preferred label: autoprotection des peuplements forestiers @fr
was quoted from: Adapted from Rigolot & Costa (coord.) (2000) Conception des coupures de combustible. Réseau Coupures de combustible RCC n°4, 2000. [En ligne]. Éditions de la Cardère. [Consulté le 01/04/2026]. <URL : https://cardere.fr/doc/RCC4.pdf>
was quoted from: Adapté de Rigolot & Costa (coord.) (2000) Conception des coupures de combustible. Réseau Coupures de combustible RCC n°4, 2000. [En ligne]. Éditions de la Cardère. [Consulté le 01/04/2026]. <URL : https://cardere.fr/doc/RCC4.pdf> @fr

value exposed to risk
has status: Published
type: Concept
broader: exposed asset
definition: Tout élément auquel on attache de l’importance menacé par un aléa. @fr
definition: Any element to which importance is attached and which is threatened by a hazard.
in scheme: Thesaurus Multirisque FORESTT
narrower: damage measure
preferred label: valeur exposée au risque @fr
was quoted from: Adapté de GIEC. (2018). Glossaire. [En ligne]. Genève, GIEC. [Consulté le 20/02/2026]. <URL : https://www.ipcc.ch/site/assets/uploads/sites/2/2019/10/SR15_Glossary_french.pdf>. @fr
was quoted from: Adapted from GIEC. (2018). Glossaire. [En ligne]. Genève, GIEC. [Consulté le 20/02/2026]. <URL : https://www.ipcc.ch/site/assets/uploads/sites/2/2019/10/SR15_Glossary_french.pdf>.

correlated risks
has status: Published
type: Concept
broader: multi-risk
definition: Risques en interaction avec ou sans signification statistique. @fr
definition: Interacting risks, with or without statistical significance.
in scheme: Thesaurus Multirisque FORESTT
preferred label: risques corrélés @fr
was quoted from: Groupe de travail « Thésaurus du multirisque en forêt » du projet X-RISKS du PEPR FORESTT (ANR-24-PEFO-0005). [En ligne]. <URL : https://www.pepr-forestt.fr/projets/pc-x-risks> @fr

downstream actor failure
has status: Published
type: Concept
broader: actor failure
definition: Acteur de l'aval de la filière forêt-bois (scierie, industriel du bois, négociant...) qui ne remplit plus sa fonction de transformation ou de distribution du bois, par baisse ou arrêt d'activité. @fr
definition: Downstream forest-wood sector actor (sawmill, wood industrialist, trader...) who no longer fulfils their wood processing or distribution function, due to a decline or cessation of activity.
in scheme: Thesaurus Multirisque FORESTT
preferred label: défaillance d'acteurs aval @fr
was quoted from: Adapté de France Industrie. Filière bois : quels sont les acteurs en France ? [En ligne]. France Industrie. [Consulté le 07/04/2026]. <URL : https://www.france-industrie.pro/quelles-sont-les-entreprises-de-la-filiere-bois-en-france-roles-et-enjeux-de-chaque-maillon-de-lindustrie/> @fr
was quoted from: Adapted from France Industrie. Filière bois : quels sont les acteurs en France ? [En ligne]. France Industrie. [Consulté le 07/04/2026]. <URL : https://www.france-industrie.pro/quelles-sont-les-entreprises-de-la-filiere-bois-en-france-roles-et-enjeux-de-chaque-maillon-de-lindustrie/>

even-aged stand
has status: Published
type: Concept
broader: structural heterogeneity
definition: Stand whose trees are of similar age.
definition: Peuplement dont les arbres ont des âges proches. @fr
in scheme: Thesaurus Multirisque FORESTT
preferred label: peuplement équienne @fr
was quoted from: Adapted from Helms (1998) The Dictionary of Forestry. Society of American Foresters, Bethesda, MD.
was quoted from: Adapté de Helms (1998) The Dictionary of Forestry. Society of American Foresters, Bethesda, MD. @fr

owners' dependence on forestry income
has status: Published
type: Concept
broader: vulnerability of owners
definition: Vulnérabilité liée à une dépendance forte des propriétaires forestiers aux seuls revenus de la forêt. @fr
definition: Vulnerability related to a strong dependence of forest owners on forest income alone.
in scheme: Thesaurus Multirisque FORESTT
preferred label: dépendance des propriétaires aux revenus forestiers @fr
was quoted from: Groupe de travail « Thésaurus du multirisque en forêt » du projet X-RISKS du PEPR FORESTT (ANR-24-PEFO-0005). [En ligne]. <URL : https://www.pepr-forestt.fr/projets/pc-x-risks> @fr

risk measure
has status: Published
type: Concept
broader: quantitative risk assessment
definition: Number or quantity that reflects a level of risk, and which is associated with a unit.
definition: Nombre ou quantité qui rend compte d'un niveau de risque, et qui est associé à une unité. @fr
in scheme: Thesaurus Multirisque FORESTT
narrower: extreme value theory
narrower: hyperparameter
narrower: return period
narrower: risk score
preferred label: mesure du risque @fr
was quoted from: Adapted from AGROVOC. Mesure. [En ligne]. FAO. [Consulté le 25/03/2026]. <URL : https://agrovoc.fao.org/browse/agrovoc/fr/page/c_330493>
was quoted from: Adapté de AGROVOC. Mesure. [En ligne]. FAO. [Consulté le 25/03/2026]. <URL : https://agrovoc.fao.org/browse/agrovoc/fr/page/c_330493> @fr

deciduous foliage
type: Concept
broader: species-specific sensitivity
definition: Caractéristique du feuillage d'un arbre qui tombe à la fin de la saison de végétation. Cette saisonnalité modifie l'exposition à certains aléas comme le gel tardif au moment du renouvellement, ou encore les vents violents avec une réduction de la prise au vent au moment des tempêtes hivernales, argument évoqué pour expliquer la sensibilité plus forte des résineux par rapport aux feuillus. @fr
definition: Characteristic of a tree's foliage that falls at the end of the growing season. This seasonality changes exposure to certain hazards, such as late frost at the time of renewal, or violent winds, with reduced wind resistance during winter storms - an argument put forward to explain the greater sensitivity of conifers compared with broadleaves.
in scheme: Thesaurus Multirisque FORESTT
preferred label: feuillage caduc @fr
was quoted from: Groupe de travail « Thésaurus du multirisque en forêt » du projet X-RISKS du PEPR FORESTT (ANR-24-PEFO-0005). [En ligne]. <URL : https://www.pepr-forestt.fr/projets/pc-x-risks> @fr

water level
has status: Published
type: Concept
broader: hazard characterisation
definition: Niveau atteint par l’eau lors d’une crue. @fr
definition: Level reached by water during a flood.
in scheme: Thesaurus Multirisque FORESTT
preferred label: hauteur d’eau @fr
was quoted from: Adapté de CEHQ. Méthodes estimation. [En ligne]. Québec, CEHQ. [Consulté le 20/02/2026]. <URL : https://www.cehq.gouv.qc.ca/debits-crues/methodes-estimation.htm>. @fr
was quoted from: Adapted from CEHQ. Méthodes estimation. [En ligne]. Québec, CEHQ. [Consulté le 20/02/2026]. <URL : https://www.cehq.gouv.qc.ca/debits-crues/methodes-estimation.htm>.

fencing
has status: Published
type: Concept
broader: physical protection
definition: Barrière physique entourant les parcelles forestières contre les dégâts de rongeurs ou de grands ongulés. @fr
definition: Physical barrier surrounding forest plots against damage from rodents or large ungulates.
in scheme: Thesaurus Multirisque FORESTT
preferred label: clôture @fr
was quoted from: Adapted from CNPF Grand Est. Chasse et équilibre forêt-gibier. [En ligne]. Centre National de la Propriété Forestière - Grand Est. [Consulté le 25/03/2026]. <URL : https://grandest.cnpf.fr/la-gestion-durable/gestion-des-risques/chasse-et-equilibre-foret-gibier>
was quoted from: Adapté de CNPF Grand Est. Chasse et équilibre forêt-gibier. [En ligne]. Centre National de la Propriété Forestière - Grand Est. [Consulté le 25/03/2026]. <URL : https://grandest.cnpf.fr/la-gestion-durable/gestion-des-risques/chasse-et-equilibre-foret-gibier> @fr

drought duration
has status: Published
type: Concept
broader: hazard characterisation
definition: Période mesurable pendant laquelle a lieu une sécherresse. @fr
definition: Measurable period during which a drought occurs.
in scheme: Thesaurus Multirisque FORESTT
preferred label: durée de la sécheresse @fr
was quoted from: Adapté de INRAE (2023) Qu’est-ce que la sécheresse ? [En ligne]. [Consulté le 20/02/2026]. <URL : https://www.inrae.fr/actualites/quest-ce-que-secheresse>. @fr
was quoted from: Adapted from INRAE (2023) Qu’est-ce que la sécheresse ? [En ligne]. [Consulté le 20/02/2026]. <URL : https://www.inrae.fr/actualites/quest-ce-que-secheresse>.

wet snow
has status: Published
type: Concept
broader: hazard characterisation
definition: Neige à forte teneur en eau favorisant les avalanches denses. @fr
definition: Snow with a high water content favouring dense avalanches.
in scheme: Thesaurus Multirisque FORESTT
preferred label: neige lourde @fr
was quoted from: Adapté de Météo France. [En ligne]. Toulouse, Météo France. [Consulté le 20/02/2026]. <URL : https://meteofrance.com/comprendre-la-meteo/precipitations/les-avalanches/> @fr
was quoted from: Adapted from Météo France. [En ligne]. Toulouse, Météo France. [Consulté le 20/02/2026]. <URL : https://meteofrance.com/comprendre-la-meteo/precipitations/les-avalanches/>

burnt wood
has status: Published
type: Concept
broader: crisis timber
definition: Bois carbonisé ou endommagé par le feu. @fr
definition: Wood charred or damaged by fire.
in scheme: Thesaurus Multirisque FORESTT
preferred label: bois brûlé @fr

rise in energy costs for processing actors
has status: Published
type: Concept
broader: vulnerability of processing actors
definition: Vulnerability of forest processing actors related to rising energy costs for drying and processing.
definition: Vulnérabilité des acteurs de la transformation forestière liée à l'augmentation des coût de l'énergie pour le séchage et la transformation. @fr
in scheme: Thesaurus Multirisque FORESTT
preferred label: hausse du coût de l'énergie pour les acteurs de la transformation @fr
was quoted from: Adapted from https://www.forestopic.com/fr/en-bref/2022-crise-energetique-quelles-aides-pour-entreprises-forestieres?highlight=WyJcdTAwZTluZXJnaWUiLCJcdTAwZTluZXJnaWVzIiwiXHUwMGU5bmVyZ2lxdWUiLCJcdTAwZTluZXJnaXF1ZW1lbnQiXQ==
was quoted from: Adapté de https://www.forestopic.com/fr/en-bref/2022-crise-energetique-quelles-aides-pour-entreprises-forestieres?highlight=WyJcdTAwZTluZXJnaWUiLCJcdTAwZTluZXJnaWVzIiwiXHUwMGU5bmVyZ2lxdWUiLCJcdTAwZTluZXJnaXF1ZW1lbnQiXQ== @fr

burnt area
has status: Published
type: Concept
broader: hazard characterisation
definition: Surface de végétation consommée par un incendie. @fr
definition: Area of vegetation consumed by a fire.
in scheme: Thesaurus Multirisque FORESTT
preferred label: surface brûlée @fr

monitoring
has status: Published
type: Concept
broader: forest management for risk adaptation and management
definition: Suivi de l’évolution de l’état sanitaire des peuplements forestiers, réalisation d'une veille active vis-à-vis des organismes réglementés et émergents et information les partenaires forestiers. @fr
definition: Tracking of changes in the health status of forest stands, active watch for regulated and emerging organisms, and informing forestry partners.
in scheme: Thesaurus Multirisque FORESTT
narrower: general surveillance
narrower: early detection
narrower: targeted monitoring
narrower: fire outbreak surveillance
preferred label: surveillance @fr
was quoted from: Boutte (2024) Risques multiples et santé des forêts. DSF. [En ligne]. Paris, Ministère de l’Agriculture et de la Souveraineté alimentaire. [Consulté le 20/02/2026]. <URL : https://agriculture.gouv.fr/telecharger/144517>.

zone infested by pine wood nematode
has status: Published
type: Concept
broader: national emergency health intervention plan (PNISU) for Bursaphelenchus xylophilus (pine wood nematode)
definition: Zone où le nématode du pin est confirmé. @fr
definition: Zone where the pine wood nematode is confirmed.
in scheme: Thesaurus Multirisque FORESTT
preferred label: zone infestée par le nématode du pin @fr
was quoted from: Adapté de Ministère de l’Agriculture. Instruction DGAL/SDQSPV/2019-209 (Plan national d’intervention sanitaire d’urgence - Nématode du pin). [En ligne]. 2019. [Consulté le 25/03/2026]. <URL : https://info.agriculture.gouv.fr/boagri/instruction-2019-209> @fr
was quoted from: Adapted from Ministère de l’Agriculture. Instruction DGAL/SDQSPV/2019-209 (Plan national d’intervention sanitaire d’urgence - Nématode du pin). [En ligne]. 2019. [Consulté le 25/03/2026]. <URL : https://info.agriculture.gouv.fr/boagri/instruction-2019-209>

soil with low available water capacity
has status: Published
type: Concept
alternative label: sol à faible capacité de rétention d'eau @fr
alternative label: soil with low water retention capacity
broader: sensitivity related to water conditions
definition: Sol offrant un faible volume d’eau utilisable par les plantes. @fr
definition: Soil offering a low volume of water usable by plants.
in scheme: Thesaurus Multirisque FORESTT
preferred label: sol à faible réserve utile en eau @fr
was quoted from: Adapté de Plantes-et-eau.fr. [En ligne]. [Consulté le 20/02/2026]. <URL : https://www.plantes-et-eau.fr/documentation/outils-et-concepts-de-base/17-le-sol-reservoir-d-eau-pour-les-plantes/119-les-relations-potentiel-hydrique-humidite-dans-un-sol>. @fr
was quoted from: Adapted from Plantes-et-eau.fr. [En ligne]. [Consulté le 20/02/2026]. <URL : https://www.plantes-et-eau.fr/documentation/outils-et-concepts-de-base/17-le-sol-reservoir-d-eau-pour-les-plantes/119-les-relations-potentiel-hydrique-humidite-dans-un-sol>.

choice of species
has status: Published
type: Concept
broader: preventive silviculture
definition: Sélection d’essences forestières adaptées au climat et aux risques futurs. @fr
definition: Selection of forest species adapted to climate and future risks.
in scheme: Thesaurus Multirisque FORESTT
narrower: species mixing
narrower: choice of provenances
narrower: adjust stand composition during interventions
narrower: assisted migration
narrower: choice of less fire-vulnerable species
preferred label: choix des essences @fr
was quoted from: Adapté de Legay (2019) Adapter les forêts du Grand Est au changement climatique : Comment choisir les essences-objectifs. [En ligne]. INRAE. [Consulté le 01/04/2026]. <URL : https://renfor.hub.inrae.fr/content/download/3925/36598?version=1> @fr
was quoted from: Adapted from Legay (2019) Adapter les forêts du Grand Est au changement climatique : Comment choisir les essences-objectifs. [En ligne]. INRAE. [Consulté le 01/04/2026]. <URL : https://renfor.hub.inrae.fr/content/download/3925/36598?version=1>

exposed forest manager
has status: Published
type: Concept
broader: exposed actor of the forest-wood sector
definition: Gestionnaire forestier susceptible de subir des dommages, du fait de son exposition à des aléas. @fr
definition: Forest manager likely to suffer damage due to exposure to hazards.
in scheme: Thesaurus Multirisque FORESTT
preferred label: gestionnaire forestier exposé @fr
was quoted from: Groupe de travail « Thésaurus du multirisque en forêt » du projet X-RISKS du PEPR FORESTT (ANR-24-PEFO-0005). [En ligne]. <URL : https://www.pepr-forestt.fr/projets/pc-x-risks> @fr

early harvest
has status: Published
type: Concept
broader: curative silvicultural action
definition: Early harvest to make use of wood before it depreciates due to a health problem.
definition: Récolte précoce pour valoriser le bois avant dépréciation du fait d'un problème sanitaire. @fr
in scheme: Thesaurus Multirisque FORESTT
preferred label: récolte anticipée @fr
was quoted from: Adapted from Renaud et al. (2023) Les crises forestières dans le Grand Est : un défi pour la filière bois aujourd'hui. Menaces ou opportunités pour demain ? Revue forestière française, 74(2), 153-163. [En ligne]. [Consulté le 25/03/2026]. <URL : https://revueforestierefrancaise.agroparistech.fr/article/view/7589>
was quoted from: Adapté de Renaud et al. (2023) Les crises forestières dans le Grand Est : un défi pour la filière bois aujourd'hui. Menaces ou opportunités pour demain ? Revue forestière française, 74(2), 153-163. [En ligne]. [Consulté le 25/03/2026]. <URL : https://revueforestierefrancaise.agroparistech.fr/article/view/7589> @fr

recruitment difficulty for forestry work companies
has status: Published
type: Concept
broader: vulnerability of forestry work companies
definition: Vulnérabilité des entreprises de travaux forestiers liée aux difficultés de recrutement, et de formation du personnel. @fr
definition: Vulnerability of forestry work companies related to difficulties in recruiting and training staff.
in scheme: Thesaurus Multirisque FORESTT
preferred label: difficulté de recrutement pour les entreprises de travaux forestiers @fr
was quoted from: Groupe de travail « Thésaurus du multirisque en forêt » du projet X-RISKS du PEPR FORESTT (ANR-24-PEFO-0005). [En ligne]. <URL : https://www.pepr-forestt.fr/projets/pc-x-risks> @fr

forest-weather index (FWI)
has status: Published
type: Concept
broader: general surveillance
definition: Indicateur mesurant le niveau de danger météorologique feux de forêt à partir de la température, du vent, de l’humidité et des précipitations. @fr
definition: Indicator measuring the level of forest fire weather danger based on temperature, wind, humidity and precipitation.
in scheme: Thesaurus Multirisque FORESTT
preferred label: indice forêt-météo (IFM) @fr
was quoted from: Adapté de Observatoire des forêts françaises. Évaluer le niveau de risque. 2024. [En ligne]. Observatoire des forêts françaises. [Consulté le 02/04/2026]. <URL : https://observatoire.foret.gouv.fr/themes/evaluer-le-niveau-de-risque> @fr
was quoted from: Adapted from Observatoire des forêts françaises. Évaluer le niveau de risque. 2024. [En ligne]. Observatoire des forêts françaises. [Consulté le 02/04/2026]. <URL : https://observatoire.foret.gouv.fr/themes/evaluer-le-niveau-de-risque>

storage assistance
has status: Published
type: Concept
broader: reconstitution plan
definition: Aide au stockage des bois de crise selon les recommandations techniques pour le maintien de la qualité du bois et l'évitement de la pullulation de scolytes. @fr
definition: Assistance for storing crisis timber according to technical recommendations to maintain wood quality and avoid bark beetle outbreaks.
in scheme: Thesaurus Multirisque FORESTT
preferred label: aide au stockage @fr
was quoted from: Adapté de Ayphassorho et al. (2025) Valorisation des bois de crise et résilience de la filière forêt-bois : Vers une culture du risque. Rapport CGAAER n° 24073 - IGEDD n° 015817-01. IGEDD / CGAAER, 2025, 166 p. [En ligne]. [Consulté le 25/03/2026]. <URL : https://www.igedd.developpement-durable.gouv.fr/IMG/pdf/015817-01_rapport_publie_cle5431ce.pdf> @fr
was quoted from: Adapted from Ayphassorho et al. (2025) Valorisation des bois de crise et résilience de la filière forêt-bois : Vers une culture du risque. Rapport CGAAER n° 24073 - IGEDD n° 015817-01. IGEDD / CGAAER, 2025, 166 p. [En ligne]. [Consulté le 25/03/2026]. <URL : https://www.igedd.developpement-durable.gouv.fr/IMG/pdf/015817-01_rapport_publie_cle5431ce.pdf>

rongeur
type: Collection
in scheme: Thesaurus Multirisque FORESTT
member: understory maintenance
member: root damage
member: trunk damage
member: collar damage
member: varietal mixture
member: rodent
member: small rodent
member: large rodent

loss of economic viability of the company
has status: Published
type: Concept
broader: economic loss
definition: Dégradation pour un acteur de la filière forêt-bois de sa capacité à générer des profits et un rendement financier satisfaisants. @fr
definition: Deterioration, for a forest-wood sector actor, of its capacity to generate satisfactory profits and financial returns.
in scheme: Thesaurus Multirisque FORESTT
preferred label: perte de viabilité économique de l'entreprise @fr
was quoted from: Groupe de travail « Thésaurus du multirisque en forêt » du projet X-RISKS du PEPR FORESTT (ANR-24-PEFO-0005). [En ligne]. <URL : https://www.pepr-forestt.fr/projets/pc-x-risks> @fr

lack of support from homeowners
has status: Published
modified: 2026-08-04T09:32:26.727
type: Concept
alternative label: management delegation
alternative label: délégation de gestion @fr
broader: socio-economic profile of the owner
in scheme: Thesaurus Multirisque FORESTT
preferred label: manque d'appui des propriétaires @fr

gravitational hazard
has status: Published
type: Concept
alternative label: aléa en montagne @fr
alternative label: mountain hazard
broader: natural hazard
definition: Déplacement de terrain plus ou moins soudain et rapide sous l’effet de précipitations, de gel/dégel ou d'actions anthropiques (déboisement). @fr
definition: More or less sudden and rapid ground movement under the effect of precipitation, freeze/thaw cycles or human actions (deforestation).
in scheme: Thesaurus Multirisque FORESTT
narrower: torrential hazard
narrower: ground movement
narrower: avalanche
narrower: glacial hazard
preferred label: aléa gravitaire @fr
was quoted from: Adapté de Géoconfluences. Typologie des risques et catastrophes. [En ligne]. ENS Lyon. [Consulté le 03/06/2026]. <URL : https://geoconfluences.ens-lyon.fr/glossaire/typologie-des-risques-et-catastrophes> @fr
was quoted from: Adapted from Géoconfluences. Typologie des risques et catastrophes. [En ligne]. ENS Lyon. [Consulté le 03/06/2026]. <URL : https://geoconfluences.ens-lyon.fr/glossaire/typologie-des-risques-et-catastrophes>

human life
has status: Published
type: Concept
alternative label: victime @fr
alternative label: personne @fr
alternative label: casualty
alternative label: person
broader: human asset at risk
definition: Personne exposée à un aléa de la forêt dont la vie est menacée. @fr
definition: Person exposed to a forest hazard whose life is threatened.
in scheme: Thesaurus Multirisque FORESTT
preferred label: vie humaine @fr
was quoted from: Adapté de GIEC (2018) Glossaire. [En ligne]. Genève, GIEC. [Consulté le 20/02/2026]. <URL : https://www.ipcc.ch/site/assets/uploads/sites/2/2019/10/SR15_Glossary_french.pdf>. @fr
was quoted from: Adapted from GIEC (2018) Glossaire. [En ligne]. Genève, GIEC. [Consulté le 20/02/2026]. <URL : https://www.ipcc.ch/site/assets/uploads/sites/2/2019/10/SR15_Glossary_french.pdf>.

thin bark
has status: Published
type: Concept
broader: species-specific sensitivity
definition: Low bark thickness offering little protection against fire and injury.
definition: Faible épaisseur d’écorce offrant peu de protection contre le feu et les blessures. @fr
in scheme: Thesaurus Multirisque FORESTT
preferred label: écorce fine @fr
was quoted from: Adapté de Revertegat et al. (2025) Synthèse sur la vulnérabilité des peuplements forestiers au feu. Rapport final du projet AFORCE VULNEFEU (Vulnefeu04). [En ligne]. Réseau AFORCE, 2025. [Consulté le 25/03/2026]. <URL : https://www.reseau-aforce.fr/sites/reseau-aforce/files/2025-07/Rapport-Vulnefeu04-compressed.pdf @fr
was quoted from: Adapted from Revertegat et al. (2025) Synthèse sur la vulnérabilité des peuplements forestiers au feu. Rapport final du projet AFORCE VULNEFEU (Vulnefeu04). [En ligne]. Réseau AFORCE, 2025. [Consulté le 25/03/2026]. <URL : https://www.reseau-aforce.fr/sites/reseau-aforce/files/2025-07/Rapport-Vulnefeu04-compressed.pdf

phytopathogenic bacterium
has status: Published
type: Concept
broader: non-fungal phytopathogenic agent
definition: Organisme unicellulaire dépourvu de noyau provoquant des maladies. @fr
definition: Unicellular organism lacking a nucleus that causes disease.
in scheme: Thesaurus Multirisque FORESTT
preferred label: bactérie phytopathogène @fr
was quoted from: Adapté de SCF RNCan. Termes. [En ligne]. Ottawa, SCF RNCan. [Consulté le 20/02/2026]. <URL : https://scf.rncan.gc.ca/termes>. @fr
was quoted from: Adapted from SCF RNCan. Termes. [En ligne]. Ottawa, SCF RNCan. [Consulté le 20/02/2026]. <URL : https://scf.rncan.gc.ca/termes>.

rockfall
has status: Published
type: Concept
broader: rapid ground movement
definition: Détachement brutal, depuis une paroi (sub)verticale, d’une masse rocheuse de volume supérieur à 1 dm3, et qui se propage rapidement vers l’aval sous l’effet de la gravité. @fr
definition: Sudden detachment, from a (sub)vertical rock face, of a rock mass larger than 1 dm3, which rapidly propagates downhill under the effect of gravity.
in scheme: Thesaurus Multirisque FORESTT
preferred label: chute de blocs @fr
was quoted from: Adapté de INRAE. Chutes de blocs et risque rocheux : quand la montagne gronde. [En ligne]. Publié le 15 avril 2024. [Consulté le 25/03/2026]. <URL : https://www.inrae.fr/dossiers/chutes-blocs-risque-rocheux-quand-montagne-gronde> @fr
was quoted from: Adapted from INRAE. Chutes de blocs et risque rocheux : quand la montagne gronde. [En ligne]. Publié le 15 avril 2024. [Consulté le 25/03/2026]. <URL : https://www.inrae.fr/dossiers/chutes-blocs-risque-rocheux-quand-montagne-gronde>

foreseeable natural risk prevention plan
has status: Published
type: Concept
broader: regulatory measure
definition: State instrument for natural risk prevention, aimed at reducing the vulnerability of people and property. The PPRN allows all risks to be taken into account, including floods, but also earthquakes, ground movements, forest fires, avalanches, etc.
definition: Instrument de l'action de l'état en matière de prévention des risques naturels, afin de réduire la vulnérabilité des personnes et des biens. Le PPRN permet de prendre en compte l'ensemble des risques, dont les inondations, mais aussi les séismes, les mouvements de terrain, les incendies de forêt, les avalanches, etc. @fr
in scheme: Thesaurus Multirisque FORESTT
narrower: ground movement risk prevention plan (PPRMT)
narrower: forest fire risk prevention plan (PPRIF)
narrower: flood risk prevention plan (PPRI)
preferred label: plan de prévention des risques naturels prévisibles @fr
was quoted from: Adapted from Géorisques. Plan de prévention des risques naturels prévisibles (PPRN). [En ligne]. Ministère de la Transition écologique. [Consulté le 25/03/2026]. <URL : https://www.georisques.gouv.fr/glossaire/plan-de-prevention-des-risques-naturels-previsibles-pprn>
was quoted from: Adapté de Géorisques. Plan de prévention des risques naturels prévisibles (PPRN). [En ligne]. Ministère de la Transition écologique. [Consulté le 25/03/2026]. <URL : https://www.georisques.gouv.fr/glossaire/plan-de-prevention-des-risques-naturels-previsibles-pprn> @fr

French forest fire database (BDIFF)
has status: Published
type: Concept
broader: general surveillance
definition: Application internet chargée de centraliser l'ensemble des données sur les incendies de forêt sur le territoire français depuis 2006 et de mettre l'ensemble de cette information à disposition du public et des services de l'Etat. @fr
definition: Internet application responsible for centralising all forest fire data across French territory since 2006 and making this information available to the public and state services.
in scheme: Thesaurus Multirisque FORESTT
preferred label: base de données des incendies de forêt en France (BDIFF) @fr
was quoted from: Adapté de Ministère de l'Agriculture. BDIFF - Base de données sur les incendies de forêts en France. [En ligne]. Ministère de l'Agriculture. [Consulté le 02/04/2026]. <URL : https://bdiff.agriculture.gouv.fr/> @fr
was quoted from: Adapted from Ministère de l'Agriculture. BDIFF - Base de données sur les incendies de forêts en France. [En ligne]. Ministère de l'Agriculture. [Consulté le 02/04/2026]. <URL : https://bdiff.agriculture.gouv.fr/>

ten-year flood
has status: Published
type: Concept
broader: flood
definition: Crue qui a une chance sur dix de se produire chaque année, c'est-à-dire que ce débit a une chance sur dix d'être atteint chaque année. @fr
definition: A flood that has a one-in-ten chance of occurring each year, i.e. this flow rate has a one-in-ten chance of being reached each year.
in scheme: Thesaurus Multirisque FORESTT
preferred label: crue décennale @fr
was quoted from: Geoconfluences. Glossaire. [En ligne]. Lyon, ENS Lyon. [Consulté le 20/02/2026]. <URL : https://geoconfluences.ens-lyon.fr/glossaire/crue-decennale-centenale>. @fr

forest sensitivity related to human actions
has status: Published
type: Concept
broader: sensitivity related to soil-climate conditions
definition: Extent to which a forest ecosystem is affected by a hazard due to human actions.
definition: Mesure dans laquelle un écosystème forestier est affecté par un aléa du fait d'actions de l'homme. @fr
in scheme: Thesaurus Multirisque FORESTT
narrower: sensitivity related to silviculture
narrower: sensitivity to large-scale human actions
preferred label: sensibilité de la forêt liée aux actions de l'homme @fr
was quoted from: Groupe de travail « Thésaurus du multirisque en forêt » du projet X-RISKS du PEPR FORESTT (ANR-24-PEFO-0005). [En ligne]. <URL : https://www.pepr-forestt.fr/projets/pc-x-risks> @fr

trackside verge maintenance
has status: Published
type: Concept
broader: open habitat management
definition: Maintenance des bandes enherbées en bordure des pistes forestières pour attirer les grands ongulés sur une ressource alimentaire alternative. @fr
definition: Maintenance of grassy strips alongside forest tracks to attract large ungulates towards an alternative food resource.
in scheme: Thesaurus Multirisque FORESTT
preferred label: entretien bords de pistes @fr
was quoted from: Adapté de Marell et al. (2022) Risques environnementaux et ongulés sauvages : un sujet à multiples facettes. [Rapport de recherche] INRAE UR EFNO; INRAE UR CEFS. 2022, pp.44. [En ligne]. [Consulté le 25/03/2026]. <URL: https://hal.inrae.fr/hal-03630674>. @fr
was quoted from: Adapted from Marell et al. (2022) Risques environnementaux et ongulés sauvages : un sujet à multiples facettes. [Rapport de recherche] INRAE UR EFNO; INRAE UR CEFS. 2022, pp.44. [En ligne]. [Consulté le 25/03/2026]. <URL: https://hal.inrae.fr/hal-03630674>.

risk assessment
has status: Published
type: Concept
broader: risk
definition: Estimation scientifique des risques sur le plan qualitatif ou quantitatif. @fr
definition: Scientific estimation of risks, either qualitatively or quantitatively.
in scheme: Thesaurus Multirisque FORESTT
narrower: qualitative risk assessment
narrower: quantitative risk assessment
preferred label: évaluation du risque @fr
was quoted from: GIEC. (2018) Glossaire. [En ligne]. Genève, GIEC. [Consulté le 20/02/2026]. <URL: https://www.ipcc.ch/site/assets/uploads/sites/2/2019/10/SR15_Glossary_french.pdf>. @fr

natech
has status: Published
type: Concept
alternative label: évènement natech @fr
alternative label: effet natech @fr
alternative label: cascade natech @fr
alternative label: natech event
alternative label: natech effect
alternative label: natech cascade
broader: cascade effect
definition: Contraction de « naturel » et « technologique » désignant l'impact qu’une catastrophe naturelle peut engendrer sur tout ou partie d’une installation industrielle. @fr
definition: Contraction of "natural" and "technological", designating the impact that a natural disaster can have on all or part of an industrial facility.
in scheme: Thesaurus Multirisque FORESTT
was quoted from: Adapté de INERIS. L'expertise de l'INERIS sur les « NaTech ». 2012. [En ligne]. INERIS. [Consulté le 07/04/2026]. <URL : https://www.ineris.fr/sites/default/files/contribution/Documents/fiche-natech-1350563629.pdf> @fr
was quoted from: Adapted from INERIS. L'expertise de l'INERIS sur les « NaTech ». 2012. [En ligne]. INERIS. [Consulté le 07/04/2026]. <URL : https://www.ineris.fr/sites/default/files/contribution/Documents/fiche-natech-1350563629.pdf>

sanitary felling
has status: Published
type: Concept
alternative label: coupe d’urgence @fr
alternative label: emergency felling
broader: curative silvicultural action
definition: Coupe des arbres morts, endommagés ou vulnérables, essentiellement pour éviter la propagation des parasites ou des pathogènes et ainsi assainir la forêt. @fr
definition: Felling of dead, damaged or vulnerable trees, mainly to prevent the spread of pests or pathogens and thereby improve forest health.
in scheme: Thesaurus Multirisque FORESTT
preferred label: coupe sanitaire @fr
was quoted from: Adapté de Cours et al. (2023). Conséquences des coupes sanitaires sur la résilience des écosystèmes forestiers perturbés : Une revue de la littérature. Revue forestière française, 2023. [En ligne]. [Consulté le 03/06/2026]. <URL : https://revueforestierefrancaise.agroparistech.fr/article/view/7595> @fr
was quoted from: Adapted from Cours et al. (2023). Conséquences des coupes sanitaires sur la résilience des écosystèmes forestiers perturbés : Une revue de la littérature. Revue forestière française, 2023. [En ligne]. [Consulté le 03/06/2026]. <URL : https://revueforestierefrancaise.agroparistech.fr/article/view/7595>

decline
has status: Published
type: Concept
broader: damage characterisation
definition: Déclin graduel de l’état de santé d’un arbre, ralentit sa croissance et peut entraîner sa mort. @fr
definition: Gradual decline in a tree's health, slowing its growth and potentially leading to its death.
in scheme: Thesaurus Multirisque FORESTT
preferred label: dépérissement @fr
was quoted from: Adapté de Landmann (1994). Concepts, définitions et caractéristiques générales des dépérissements forestiers. Revue forestière française, 46, pp. 405-415. @fr
was quoted from: Adapted from Landmann (1994). Concepts, définitions et caractéristiques générales des dépérissements forestiers. Revue forestière française, 46, pp. 405-415.

multi-risk
has status: Published
type: Concept
alternative label: multi-risque @fr
definition: Prise en compte globale de tous les risques au sein d'un système donné, y compris toutes les interactions entre les dangers et/ou les enjeux sociaux et environnementaux. @fr
definition: Comprehensive consideration of all risks within a given system, including all interactions between hazards and/or social and environmental assets.
in scheme: Thesaurus Multirisque FORESTT
narrower: sequential risks
narrower: compound risks
narrower: multi-risk approach
narrower: multi-hazard/vulnerability
narrower: interacting risks
narrower: correlated risks
narrower: aggregated risk
preferred label: multirisque @fr
top concept of: Thesaurus Multirisque FORESTT
was quoted from: Groupe de travail « Thésaurus du multirisque en forêt » du projet X-RISKS du PEPR FORESTT (ANR-24-PEFO-0005). [En ligne]. <URL : https://www.pepr-forestt.fr/projets/pc-x-risks> @fr

large rodent
has status: Published
type: Concept
broader: rodent
definition: Rongeur de taille relativement importante et dont les pullulations sont peu fréquentes et occasionnant des dégâts spectaculaires. @fr
definition: Relatively large rodent whose outbreaks are infrequent but cause spectacular damage.
in scheme: Thesaurus Multirisque FORESTT
preferred label: gros rongeur @fr
was quoted from: Caroulle et al. (2006) Dégâts de rongeurs en forêt. [En ligne]. [Consulté le 20/02/2026]. <URL : https://hal.science/hal-03449769v1/file/449_462_CAROULLE.qxd.pdf>. @fr

pathogenicity
type: Concept
broader: disease severity
definition: Ability of an organism to infect a host and cause disease in it. This is a qualitative property: the pathogen is either capable or incapable of causing disease in a given host.
definition: Capacité d'un organisme à infecter un hôte et à y provoquer une maladie. Il s'agit d'une propriété qualitative : le pathogène est soit capable, soit incapable de provoquer la maladie chez un hôte donné. @fr
in scheme: Thesaurus Multirisque FORESTT
preferred label: pathogénicité @fr
was quoted from: Groupe de travail « Thésaurus du multirisque en forêt » du projet X-RISKS du PEPR FORESTT (ANR-24-PEFO-0005). [En ligne]. <URL : https://www.pepr-forestt.fr/projets/pc-x-risks> @fr

integrated multi-risk management strategy
has status: Published
modified: 2026-08-04T15:01:40.669
type: Concept
alternative label: stratégie intégrée de gestion des risques @fr
alternative label: integrated risk management strategy
broader: multi-risk approach
definition: Coordination d'actions de gestion du multirisque en prenant en compte les interactions entre risques par une approche systémique. @fr
definition: Coordination of multi-risk management actions taking into account the interactions between risks through a systemic approach.
in scheme: Thesaurus Multirisque FORESTT
preferred label: stratégie intégrée de gestion du multirisque @fr
was quoted from: Groupe de travail « Thésaurus du multirisque en forêt » du projet X-RISKS du PEPR FORESTT (ANR-24-PEFO-0005). [En ligne]. <URL : https://www.pepr-forestt.fr/projets/pc-x-risks> @fr

asymptomatic tree
has status: Published
type: Concept
alternative label: arbre asymptomatique vis-à-vis du nématode du pin @fr
alternative label: tree asymptomatic to pine wood nematode
broader: sensitive host
definition: Arbre ne présentant aucun symptôme visible de nématode du pin. @fr
definition: Tree showing no visible symptoms of pine wood nematode.
in scheme: Thesaurus Multirisque FORESTT
preferred label: arbre asymptomatique @fr
was quoted from: Adapté de Plan national d'intervention sanitaire d'urgence relatif à Bursaphelenchus xylophilus (nématode du pin). [En ligne]. [Consulté le 20/02/2026]. <URL : https://info.agriculture.gouv.fr/boagri/instruction-2019-209>. @fr
was quoted from: Adapted from Plan national d'intervention sanitaire d'urgence relatif à Bursaphelenchus xylophilus (nématode du pin). [En ligne]. [Consulté le 20/02/2026]. <URL : https://info.agriculture.gouv.fr/boagri/instruction-2019-209>.

primary pest
has status: Published
type: Concept
alternative label: primary parasite
alternative label: parasite primaire @fr
broader: hazard characterisation
definition: Agent pathogène capable d’attaquer des arbres sains et vigoureux. @fr
definition: Pathogenic agent capable of attacking healthy and vigorous trees.
in scheme: Thesaurus Multirisque FORESTT
preferred label: ravageur primaire @fr
was quoted from: Adapté de e-phytia. Hypp - Euzophera pinguis. Encyclopédie en protection des plantes. [En ligne]. INRAE. [Consulté le 25/03/2026]. <URL : https://ephytia.inra.fr/fr/C/11765/Hypp-encyclopedie-en-protection-des-plantes-Euzophera-pinguis> @fr
was quoted from: Adapted from e-phytia. Hypp - Euzophera pinguis. Encyclopédie en protection des plantes. [En ligne]. INRAE. [Consulté le 25/03/2026]. <URL : https://ephytia.inra.fr/fr/C/11765/Hypp-encyclopedie-en-protection-des-plantes-Euzophera-pinguis>

loss of regulating ecosystem service
has status: Published
type: Concept
broader: damage characterisation
definition: Réduction du service de régulation fourni par les écosystèmes forestiers tel que la purification de l'eau ou la régulation du climat. @fr
definition: Reduction in the regulating service provided by forest ecosystems, such as water purification or climate regulation.
in scheme: Thesaurus Multirisque FORESTT
narrower: loss of carbon stock
narrower: loss of species habitat
preferred label: perte de service écosystémique de régulation @fr
was quoted from: Adapté de Millennium Ecosystem Assessment (2005) Ecosystems and Human Well-being. En ligne]. Millennium Ecosystem Assessment. [Consulté le 01/04/2026]. <URL : https://www.millenniumassessment.org/documents/document.765.aspx.pdf> @fr
was quoted from: Adapted from Millennium Ecosystem Assessment (2005) Ecosystems and Human Well-being. En ligne]. Millennium Ecosystem Assessment. [Consulté le 01/04/2026]. <URL : https://www.millenniumassessment.org/documents/document.765.aspx.pdf>

DEFI insurance
has status: Published
type: Concept
broader: DEFI scheme
definition: Tax incentive scheme for forest investment (DEFI), a tax credit for forest owners allowing the cost of insurance premiums covering storm or fire risk to be taken into account.
definition: Dispositif d'encouragement fiscal à l'investissement en forêt (DEFI), un crédit d’impôt pour le propriétaire forestier permettant de prendre en compte le coût de la cotisation d’assurance comprenant le risque tempête ou incendie. @fr
in scheme: Thesaurus Multirisque FORESTT
preferred label: DEFI assurance @fr
was quoted from: Adapté de DRAAF Grand Est. DEFI : Le dispositif d’encouragement fiscal à l’investissement en forêt. [En ligne]. Ministère de l’Agriculture et de la Souveraineté alimentaire. [Consulté le 07/04/2026]. <URL : https://draaf.grand-est.agriculture.gouv.fr/dispositif-d-encouragement-fiscal-a-l-investissement-en-foret-defi-a79.html> @fr
was quoted from: Adapted from DRAAF Grand Est. DEFI : Le dispositif d’encouragement fiscal à l’investissement en forêt. [En ligne]. Ministère de l’Agriculture et de la Souveraineté alimentaire. [Consulté le 07/04/2026]. <URL : https://draaf.grand-est.agriculture.gouv.fr/dispositif-d-encouragement-fiscal-a-l-investissement-en-foret-defi-a79.html>

loss of wood supply
has status: Published
type: Concept
alternative label: loss of wood production
alternative label: loss of harvest
alternative label: perte de production sylvicole @fr
alternative label: perte de récolte @fr
alternative label: perte production de bois @fr
alternative label: loss of silvicultural production
broader: loss of provisioning service
definition: Réduction de la fourniture en bois par la forêt. @fr
definition: Reduction in the wood supplied by the forest.
in scheme: Thesaurus Multirisque FORESTT
preferred label: perte en approvisionnement en bois @fr
was quoted from: Groupe de travail « Thésaurus du multirisque en forêt » du projet X-RISKS du PEPR FORESTT (ANR-24-PEFO-0005). [En ligne]. <URL : https://www.pepr-forestt.fr/projets/pc-x-risks> @fr

soil compaction
has status: Published
type: Concept
alternative label: sol compacté @fr
alternative label: compacted soil
broader: sensitivity related to silviculture
definition: Diminution du volume du sol sous compression. @fr
definition: Decrease in soil volume under compression.
in scheme: Thesaurus Multirisque FORESTT
preferred label: tassement du sol @fr
was quoted from: Communes forestières AURA & FAO (2015) Status of the World’s Soil Resources. [En ligne]. [Consulté le 20/02/2026]. <URL : https://www.communesforestieres-aura.org/documents/ressources/63/2021-cofor63_guide_lexique.pdf>. @fr

risque
type: Collection
in scheme: Thesaurus Multirisque FORESTT
member: risk to the forest
member: risk
member: crisis timber
member: damage characterisation
member: hazard characterisation
member: curative management, direct control
member: physical protection
member: foreseeable natural risk prevention plan
member: prevention
member: characterisation of damage to the forest
member: severity
member: damage frequency
member: mortality
member: income loss
member: forest sensitivity
member: vulnerability of the forest
member: lack of adaptive capacity
member: natural hazard
member: abiotic hazard
member: hazard affecting the forest
member: worst-case risk
member: qualitative risk assessment
member: risk assessment
member: severe risk
member: extreme risk
member: extreme event
member: catastrophic event
member: black swan event
member: tipping point
member: non-forest asset at risk
member: human asset at risk
member: monitoring
member: forest sensitivity related to human actions
member: climate-related forest sensitivity
member: biotic hazard
member: emergency plan
member: forest asset at risk
member: environmental asset at risk
member: critical infrastructure
member: extreme value theory
member: risk measure
member: quantitative risk assessment
member: hyperparameter
member: return period
member: risk score
member: value exposed to risk
member: damage measure
member: exposed asset
member: asset at risk
member: anthropogenic hazard
member: risk level
member: spatio-temporal framework of risk measurement
member: hazard
member: risk component
member: vulnerability
member: exposure
member: risk management
member: system of interest
member: risk scenario
member: spatial scope of risk measurement
member: time window of risk measurement
member: civil engineering measure
member: risk basin
member: reference hazard
member: damage
member: risk management measure

system of interest
has status: Published
type: Concept
alternative label: système d'intérêt @fr
broader: risk
definition: Socio-écosystème forestier et autres enjeux qui y sont liés soumis à des risques naturels. @fr
definition: Forest socio-ecosystem and other related assets subject to natural risks.
in scheme: Thesaurus Multirisque FORESTT
narrower: risk basin
preferred label: système considéré @fr
was quoted from: Groupe de travail « Thésaurus du multirisque en forêt » du projet X-RISKS du PEPR FORESTT (ANR-24-PEFO-0005). [En ligne]. <URL : https://www.pepr-forestt.fr/projets/pc-x-risks> @fr

exposed asset
has status: Published
type: Concept
alternative label: asset exposed to risk
alternative label: enjeu exposé au risque @fr
broader: asset at risk
definition: Vulnerable element such as a person, a material asset or a component of the natural environment (fauna, flora, natural resources...) likely, due to exposure to danger, to suffer damage.
definition: Elément vulnérable tel qu'une personne, un bien matériel ou une composante du milieu naturel (faune, flore, ressources naturelles…) susceptible, du fait de l’exposition au danger, de subir des dommages. @fr
in scheme: Thesaurus Multirisque FORESTT
narrower: value exposed to risk
preferred label: enjeu exposé @fr
was quoted from: Adapted from INERIS. Composantes du risque et définitions de base en risque accidentel. [En ligne]. Institut National de l’Environnement Industriel et des Risques (INERIS). [Consulté le 25/03/2026]. <URL : https://www.ineris.fr/fr/risques/comment-evaluer-risque/composantes-risque/definitions-concepts-base-risque-accidentel>
was quoted from: Adapté de INERIS. Composantes du risque et définitions de base en risque accidentel. [En ligne]. Institut National de l’Environnement Industriel et des Risques (INERIS). [Consulté le 25/03/2026]. <URL : https://www.ineris.fr/fr/risques/comment-evaluer-risque/composantes-risque/definitions-concepts-base-risque-accidentel> @fr

fire resistance
has status: Published
type: Concept
broader: forest sensitivity
definition: Capacity of trees to survive the passage of fire.
definition: Capacité des arbres à survivre au passage du feu. @fr
in scheme: Thesaurus Multirisque FORESTT
preferred label: résistance au feu @fr
was quoted from: Adapté de Revertegat et al. (2025) Synthèse sur la vulnérabilité des peuplements forestiers au feu. Rapport final du projet AFORCE VULNEFEU (Vulnefeu04). [En ligne]. Réseau AFORCE, 2025. [Consulté le 25/03/2026]. <URL : https://www.reseau-aforce.fr/sites/reseau-aforce/files/2025-07/Rapport-Vulnefeu04-compressed.pdf @fr
was quoted from: Adapted from Revertegat et al. (2025) Synthèse sur la vulnérabilité des peuplements forestiers au feu. Rapport final du projet AFORCE VULNEFEU (Vulnefeu04). [En ligne]. Réseau AFORCE, 2025. [Consulté le 25/03/2026]. <URL : https://www.reseau-aforce.fr/sites/reseau-aforce/files/2025-07/Rapport-Vulnefeu04-compressed.pdf

change in environmental regulation
has status: Published
type: Concept
broader: change in legislation
definition: Modification de la réglementation environnementale qui impacte la filière forêt-bois. @fr
definition: Amendment of environmental regulations that impacts the forest-wood sector.
in scheme: Thesaurus Multirisque FORESTT
preferred label: évolution de la réglementation environnementale @fr
was quoted from: Adapté de Forestopic. Le papetier Fibre Excellence au bord du gouffre. [En ligne]. Forestopic. [Consulté le 07/04/2026]. <URL : https://www.forestopic.com/fr/yes-i-wood/filiere-bois/1999-papetier-fibre-excellence-bord-gouffre?highlight=WyJyXHUwMGU5Z2xlbWVudGF0aW9uIiwiclx1MDBlOWdsZW1lbnRhdGlvbnMiLCJyXHUwMGU5Z2xlbWVudFx1MDBlOWVzIiwiclx1MDBlOWdsZW1lbnRlciIsInJcdTAwZTlnbGVtZW50XHUwMGU5ZSIsInJcdTAwZTlnbGVtZW50XHUwMGU5Iiwiclx1MDBlOWdsZW1lbnRhbnQiLCJlbnZpcm9ubmVtZW50YWxlIiwiZW52aXJvbm5lbWVudGF1eCIsImVudmlyb25uZW1lbnRhbCJd> @fr
was quoted from: Adapted from Forestopic. Le papetier Fibre Excellence au bord du gouffre. [En ligne]. Forestopic. [Consulté le 07/04/2026]. <URL : https://www.forestopic.com/fr/yes-i-wood/filiere-bois/1999-papetier-fibre-excellence-bord-gouffre?highlight=WyJyXHUwMGU5Z2xlbWVudGF0aW9uIiwiclx1MDBlOWdsZW1lbnRhdGlvbnMiLCJyXHUwMGU5Z2xlbWVudFx1MDBlOWVzIiwiclx1MDBlOWdsZW1lbnRlciIsInJcdTAwZTlnbGVtZW50XHUwMGU5ZSIsInJcdTAwZTlnbGVtZW50XHUwMGU5Iiwiclx1MDBlOWdsZW1lbnRhbnQiLCJlbnZpcm9ubmVtZW50YWxlIiwiZW52aXJvbm5lbWVudGF1eCIsImVudmlyb25uZW1lbnRhbCJd>

fuel break
has status: Published
type: Concept
broader: silvicultural action
definition: Ouvrage en forêt sur lequel la végétation a été traitée tant en volume qu’en structure de combustible, pour réduire la puissance d’un front de feu l’affectant. @fr
definition: Forest structure in which vegetation has been treated in both volume and fuel structure to reduce the intensity of a fire front affecting it.
in scheme: Thesaurus Multirisque FORESTT
preferred label: coupure de combustible @fr
was quoted from: Adapted from Rigolot (2002) Du plan départemental à la coupure de combustible. Guide méthodologique et pratique. Réseau Coupures de combustible n°6, 2002. [En ligne]. Éditions de la Cardère. [Consulté le 01/04/2026]. <URL : https://cardere.fr/doc/RCC6.pdf>
was quoted from: Adapté de Rigolot (2002) Du plan départemental à la coupure de combustible. Guide méthodologique et pratique. Réseau Coupures de combustible n°6, 2002. [En ligne]. Éditions de la Cardère. [Consulté le 01/04/2026]. <URL : https://cardere.fr/doc/RCC6.pdf> @fr

DEFI works
has status: Published
type: Concept
broader: DEFI scheme
definition: Dispositif d'encouragement fiscal à l'investissement en forêt (DEFI), un crédit d’impôt pour le propriétaire forestier permettant de prendre en compte la réalisation de travaux forestiers sans seuil plancher sous condition d’avoir un document de gestion durable. @fr
definition: Tax incentive scheme for forest investment (DEFI), a tax credit for forest owners allowing forestry work to be carried out with no minimum threshold, subject to having a sustainable management document.
in scheme: Thesaurus Multirisque FORESTT
preferred label: DEFI travaux @fr
was quoted from: Adapté de DRAAF Grand Est. DEFI : Le dispositif d’encouragement fiscal à l’investissement en forêt. [En ligne]. Ministère de l’Agriculture et de la Souveraineté alimentaire. [Consulté le 07/04/2026]. <URL : https://draaf.grand-est.agriculture.gouv.fr/dispositif-d-encouragement-fiscal-a-l-investissement-en-foret-defi-a79.html> @fr
was quoted from: Adapted from DRAAF Grand Est. DEFI : Le dispositif d’encouragement fiscal à l’investissement en forêt. [En ligne]. Ministère de l’Agriculture et de la Souveraineté alimentaire. [Consulté le 07/04/2026]. <URL : https://draaf.grand-est.agriculture.gouv.fr/dispositif-d-encouragement-fiscal-a-l-investissement-en-foret-defi-a79.html>

debris flow
has status: Published
type: Concept
broader: torrential hazard
definition: Écoulement en crue d'un torrent caractérisé par une très forte concentration en matériaux solides. @fr
definition: Flood flow of a torrent characterised by a very high concentration of solid material.
in scheme: Thesaurus Multirisque FORESTT
preferred label: lave torrentielle @fr
was quoted from: Adapté de Naaim-Bouvet et Richard (dir.) (2015). Les risques naturels en montagne. Éditions Quae. [En ligne]. [Consulté le 03/06/2026]. <URL : https://www.torrossa.com/en/resources/an/5063475> @fr
was quoted from: Adapted from Naaim-Bouvet et Richard (dir.) (2015). Les risques naturels en montagne. Éditions Quae. [En ligne]. [Consulté le 03/06/2026]. <URL : https://www.torrossa.com/en/resources/an/5063475>

ongulé sauvage
type: Collection
in scheme: Thesaurus Multirisque FORESTT
member: rewilding
member: deterrent signals
member: open habitat management
member: regulation of ungulate populations
member: characterise browsing pressure
member: setting hunting pressure levels to apply
member: mechanical destruction
member: uprooting of seedlings/plants
member: bark stripping
member: buck rubbing
member: trampling
member: browsing
member: auditory signals
member: olfactory signals
member: forest-wild ungulate imbalance
member: trackside verge maintenance
member: provision of alternative food resources
member: refuge zone management
member: wild ungulate
member: use of accompanying vegetation
member: fencing
member: individual mechanical protection system

flood risk prevention plan (PPRI)
has status: Published
type: Concept
broader: foreseeable natural risk prevention plan
definition: Document de planification et de prévention dédié aux risques d'inondation délimitant les zones inondables et prescrivant des règles à mettre en œuvre par collectivités publiques et par les particuliers afin de ne pas aggraver les risques existants et de ne pas en provoquer de nouveaux. @fr
definition: Planning and prevention document dedicated to flood risk, delimiting flood-prone areas and prescribing rules to be implemented by public authorities and individuals in order not to worsen existing risks and not to create new ones.
in scheme: Thesaurus Multirisque FORESTT
preferred label: plan de prévention du risque inondation (ppri) @fr
was quoted from: Adapté de CEREMA. Plan de prévention des risques naturels d’inondation (PPRI / PPRNi). [En ligne]. [Consulté le 25/03/2026]. <URL : https://outil2amenagement.cerema.fr/outils/plan-prevention-des-risques-naturels-dinondation-ppri-pprni> @fr
was quoted from: Adapted from CEREMA. Plan de prévention des risques naturels d’inondation (PPRI / PPRNi). [En ligne]. [Consulté le 25/03/2026]. <URL : https://outil2amenagement.cerema.fr/outils/plan-prevention-des-risques-naturels-dinondation-ppri-pprni>

loss of genetic material supply
has status: Published
type: Concept
broader: loss of provisioning service
definition: Perte de diversité génétique utilisable. @fr
definition: Loss of usable genetic diversity.
in scheme: Thesaurus Multirisque FORESTT
preferred label: perte en approvisionnement en matériel génétique @fr
was quoted from: Wiley. [En ligne]. [Consulté le 20/02/2026]. <URL : https://onlinelibrary.wiley.com/doi/10.1111/j.1752-4571.2011.00214.x>. @fr

national emergency health intervention plan (PNISU) for Bursaphelenchus xylophilus (pine wood nematode)
has status: Published
type: Concept
broader: regulatory measure
definition: Plan d’urgence national contre le nématode du pin. @fr
definition: National emergency plan against the pine wood nematode.
in scheme: Thesaurus Multirisque FORESTT
narrower: zone infested by pine wood nematode
narrower: buffer zone with respect to pine wood nematode
narrower: demarcated zone with respect to pine wood nematode
preferred label: Plan national d’intervention sanitaire d’urgence (PNISU) relatif à Bursaphelenchus xylophilus (nématode du pin) @fr
was quoted from: Adapté de Ministère de l’Agriculture. Instruction DGAL/SDQSPV/2019-209 (Plan national d’intervention sanitaire d’urgence - Nématode du pin). [En ligne]. 2019. [Consulté le 25/03/2026]. <URL : https://info.agriculture.gouv.fr/boagri/instruction-2019-209> @fr
was quoted from: Adapted from Ministère de l’Agriculture. Instruction DGAL/SDQSPV/2019-209 (Plan national d’intervention sanitaire d’urgence - Nématode du pin). [En ligne]. 2019. [Consulté le 25/03/2026]. <URL : https://info.agriculture.gouv.fr/boagri/instruction-2019-209>

bark-feeding insect
has status: Published
type: Concept
broader: wood-boring insect
definition: Insecte se nourrissant de l’écorce. @fr
definition: Insect feeding on bark.
in scheme: Thesaurus Multirisque FORESTT
preferred label: insecte corticiphage @fr
was quoted from: Adapté de Bouget et al. (2005) Nomenclature des groupes écologiques d’insectes liés au bois. [En ligne]. Paris, Comptes Rendus Biologies. [Consulté le 20/02/2026]. <URL : https://doi.org/10.1016/j.crvi.2005.08.003>. @fr
was quoted from: Adapted from Bouget et al. (2005) Nomenclature des groupes écologiques d’insectes liés au bois. [En ligne]. Paris, Comptes Rendus Biologies. [Consulté le 20/02/2026]. <URL : https://doi.org/10.1016/j.crvi.2005.08.003>.

trigger an "exceptional" diagnosis of the current state of the management unit
has status: Published
type: Concept
broader: general surveillance
definition: Déclenchement d’un diagnostic sanitaire approfondi en cas de crise en forêt. @fr
definition: Triggering of an in-depth health diagnosis in the event of a forest crisis.
in scheme: Thesaurus Multirisque FORESTT
preferred label: déclencher un diagnostic "exceptionnel" de l'état actuel de l'unité de gestion @fr
was quoted from: Adapté de Brunier et al. (2023) Guide de gestion des crises sanitaires en forêt. 2° édition. https://agriculture.gouv.fr/le-guide-de-gestion-des-crises-sanitaires-en-foret @fr
was quoted from: Adapted from Brunier et al. (2023) Guide de gestion des crises sanitaires en forêt. 2° édition. https://agriculture.gouv.fr/le-guide-de-gestion-des-crises-sanitaires-en-foret

hazard
has status: Published
type: Concept
alternative label: danger
broader: risk component
definition: Éventualité d’une tendance ou d’un phénomène physique, naturel ou anthropique, susceptible d’entraîner des pertes en vies humaines, des blessures ou d’autres effets sur la santé, ainsi que des dégâts et des pertes touchant les biens, les éléments d’infrastructure, les moyens de subsistance, la fourniture de services, les écosystèmes et les ressources environnementales. @fr
definition: The potential occurrence of a natural or human-induced physical event or trend that may cause loss of life, injury, or other health impacts, as well as damage and loss to property, infrastructure, livelihoods, service provision, ecosystems and environmental resources.
in scheme: Thesaurus Multirisque FORESTT
preferred label: aléa @fr
was quoted from: GIEC (2018) Glossaire. Rapport spécial sur les conséquences d’un réchauffement planétaire de 1,5 °C. [En ligne]. Genève, GIEC. [Consulté le 20/02/2026]. <URL : https://www.ipcc.ch/site/assets/uploads/sites/2/2019/10/SR15_Glossary_french.pdf>. @fr

resistant host
has status: Published
type: Concept
broader: species-specific sensitivity
definition: Plante capable d’éliminer ou de contrôler fortement le pathogène grâce à des réponses immunitaires efficaces. @fr
definition: Plant capable of eliminating or strongly controlling the pathogen through effective immune responses.
in scheme: Thesaurus Multirisque FORESTT
preferred label: hôte résistant @fr
was quoted from: Groupe de travail « Thésaurus du multirisque en forêt » du projet X-RISKS du PEPR FORESTT (ANR-24-PEFO-0005). [En ligne]. <URL : https://www.pepr-forestt.fr/projets/pc-x-risks> @fr

pure stand with low genetic diversity
has status: Published
type: Concept
broader: pure stand
definition: Peuplement où une essence a un taux de couvert libre relatif supérieur à 75 % et avec une faible variabilité génétique. @fr
definition: Stand where one species has a relative free cover rate above 75% and low genetic variability.
in scheme: Thesaurus Multirisque FORESTT
preferred label: peuplement pur à faible diversité génétique @fr
was quoted from: Adapted from IGN - Inventaire Forestier. P - Peuplement (composition). [En ligne]. Institut national de l’information géographique et forestière (IGN), © 2025. [Consulté le 25/03/2026]. <URL : https://inventaire-forestier.ign.fr/spip.php?article599#peupcomp>
was quoted from: Adapté de IGN - Inventaire Forestier. P - Peuplement (composition). [En ligne]. Institut national de l’information géographique et forestière (IGN), © 2025. [Consulté le 25/03/2026]. <URL : https://inventaire-forestier.ign.fr/spip.php?article599#peupcomp> @fr

access road network
has status: Published
type: Concept
alternative label: DFCI track
alternative label: forest track
alternative label: desserte @fr
alternative label: piste forestière @fr
alternative label: piste dfci @fr
alternative label: access track
broader: adapt forest infrastructure
definition: Coherent set of tracks providing access to a forested area, including forest fire defence tracks (DFCI tracks).
definition: Ensemble cohérent de pistes permettant la desserte d'une zone forestière, comprenant les pistes de défense des forêts contre l'incendie (pistes DFCI). @fr
in scheme: Thesaurus Multirisque FORESTT
preferred label: réseau de voies d’accès @fr
was quoted from: Adapted from Rigolot (2002) Du plan départemental à la coupure de combustible. Guide méthodologique et pratique. Réseau Coupures de combustible n°6, 2002. [En ligne]. Éditions de la Cardère. [Consulté le 01/04/2026]. <URL : https://cardere.fr/doc/RCC6.pdf>
was quoted from: Adapté de Rigolot (2002) Du plan départemental à la coupure de combustible. Guide méthodologique et pratique. Réseau Coupures de combustible n°6, 2002. [En ligne]. Éditions de la Cardère. [Consulté le 01/04/2026]. <URL : https://cardere.fr/doc/RCC6.pdf> @fr

risk component
has status: Published
type: Concept
broader: risk
definition: Facteur de risque en interaction comme l’aléa, la vulnérabilité, et l’exposition, auxquels on peut ajouter les réponses de gestion du risque. @fr
definition: Interacting risk factor such as hazard, vulnerability and exposure, to which risk management responses can be added.
in scheme: Thesaurus Multirisque FORESTT
narrower: asset at risk
narrower: hazard
narrower: vulnerability
narrower: exposure
narrower: risk management
preferred label: composante du risque @fr
was quoted from: Adapté de Simpson et al. (2021) A framework for complex climate change risk assessment. One Earth, 4(4), pp. 489-501. [En ligne]. [Consulté le 25/03/2026]. <URL : https://doi.org/10.1016/j.oneear.2021.03.005> @fr
was quoted from: Adapted from Simpson et al. (2021) A framework for complex climate change risk assessment. One Earth, 4(4), pp. 489-501. [En ligne]. [Consulté le 25/03/2026]. <URL : https://doi.org/10.1016/j.oneear.2021.03.005>

water erosion of soils
has status: Published
type: Concept
broader: soil erosion
definition: Ruissellement des pluies entraînant des particules de sol ou de roche. @fr
definition: Rainfall runoff carrying away soil or rock particles.
in scheme: Thesaurus Multirisque FORESTT
preferred label: érosion des sols par l’eau @fr
was quoted from: Adapté de Eaufrance. L’érosion. [En ligne]. [Consulté le 20/02/2026]. <URL : https://www.eaufrance.fr/lerosion>. @fr
was quoted from: Adapted from Eaufrance. L’érosion. [En ligne]. [Consulté le 20/02/2026]. <URL : https://www.eaufrance.fr/lerosion>.

sensitivity related to root phenology
has status: Published
type: Concept
broader: sensitivity related to phenology
definition: Mesure dans laquelle une espèce forestière est affectée par un aléa du fait de son activité racinaire. @fr
definition: Extent to which a forest species is affected by a hazard due to its root activity.
in scheme: Thesaurus Multirisque FORESTT
preferred label: sensibilité liée à la phénologie racinaire @fr
was quoted from: Adapté de TEMPO. Observatoire Forêts. [En ligne]. TEMPO (Réseau national d’observation de la phénologie). [Consulté le 25/03/2026]. <URL : https://tempo.pheno.fr/observatoires/observatoire-forets> @fr
was quoted from: Adapted from TEMPO. Observatoire Forêts. [En ligne]. TEMPO (Réseau national d’observation de la phénologie). [Consulté le 25/03/2026]. <URL : https://tempo.pheno.fr/observatoires/observatoire-forets>

edge shape
has status: Published
type: Concept
broader: structural heterogeneity
definition: Configuration des interfaces forêt-milieu ouvert. @fr
definition: Configuration of forest-open land interfaces.
in scheme: Thesaurus Multirisque FORESTT
preferred label: forme des lisières @fr
was quoted from: Adapté de Citego. [En ligne]. [Consulté le 20/02/2026]. <URL : https://www.citego.org/bdf_fiche-document-2690_fr.html>. @fr
was quoted from: Adapted from Citego. [En ligne]. [Consulté le 20/02/2026]. <URL : https://www.citego.org/bdf_fiche-document-2690_fr.html>.

ground intervention
has status: Published
type: Concept
broader: curative management, direct control
definition: Déploiement au sol de personnels et de d'engins pour des interventions tactiques ou de soutien lors de la lutte contre un incendie. @fr
definition: Ground deployment of personnel and vehicles for tactical or support operations during firefighting.
in scheme: Thesaurus Multirisque FORESTT
narrower: tactical fire
narrower: control line
preferred label: intervention avec des moyens terrestres @fr

stand density
has status: Published
type: Concept
broader: sensitivity related to forest structure
definition: Quantitative measure of the degree of occupation of a given area, defined by crown cover, number of trees or basal area.
definition: Mesure quantitative du degré d’occupation d’une surface donnée, définie par la couverture de cime, le nombre d’arbres ou la surface terrière. @fr
in scheme: Thesaurus Multirisque FORESTT
narrower: high LAI (leaf area index)
narrower: insufficiently thinned stand
preferred label: densité du peuplement @fr
was quoted from: Adapted from RNCan - Service canadien des forêts. Glossaire forestier : Sylviculture intensive. [En ligne]. 2019. [Consulté le 25/03/2026]. <URL : https://scf.rncan.gc.ca/termes/vue/1109>
was quoted from: Adapté de RNCan - Service canadien des forêts. Glossaire forestier : Sylviculture intensive. [En ligne]. 2019. [Consulté le 25/03/2026]. <URL : https://scf.rncan.gc.ca/termes/vue/1109> @fr

decline in forest recreational use
has status: Published
type: Concept
alternative label: récréation @fr
alternative label: recreation
broader: loss of cultural ecosystem service
definition: Réduction du service d'accueil du public fourni par les écosystèmes forestiers. @fr
definition: Reduction in the public recreational service provided by forest ecosystems.
in scheme: Thesaurus Multirisque FORESTT
preferred label: baisse de l'accueil en forêt @fr
was quoted from: Adapté de Millennium Ecosystem Assessment (2005) Ecosystems and Human Well-being. En ligne]. Millennium Ecosystem Assessment. [Consulté le 01/04/2026]. <URL : https://www.millenniumassessment.org/documents/document.765.aspx.pdf> @fr
was quoted from: Adapted from Millennium Ecosystem Assessment (2005) Ecosystems and Human Well-being. En ligne]. Millennium Ecosystem Assessment. [Consulté le 01/04/2026]. <URL : https://www.millenniumassessment.org/documents/document.765.aspx.pdf>

workplace accident
has status: Published
type: Concept
broader: vulnerability of forestry work companies
definition: Vulnérabilité des entreprises de travaux forestiers liée aux accidents du travail. @fr
definition: Vulnerability of forestry work companies related to workplace accidents.
in scheme: Thesaurus Multirisque FORESTT
preferred label: accident du travail @fr
was quoted from: Adapté de Ministère de l’Agriculture et de la Souveraineté alimentaire. Accidents du travail en forêt et changement climatique. [En ligne]. [Consulté le 03/06/2026]. <URL : https://agriculture.gouv.fr/accidents-du-travail-en-foret-et-changement-climatique> @fr
was quoted from: Adapted from Ministère de l’Agriculture et de la Souveraineté alimentaire. Accidents du travail en forêt et changement climatique. [En ligne]. [Consulté le 03/06/2026]. <URL : https://agriculture.gouv.fr/accidents-du-travail-en-foret-et-changement-climatique>

adapt the owner's risk management and prevention practices
has status: Published
type: Concept
broader: response to protect the owner
definition: ajuster les actions mises en oeuvre par le propriétaire forestier pour mieux gérer et prévenir les risques qui menacent sa propriété. @fr
definition: Adjust the actions implemented by the forest owner to better manage and prevent the risks threatening their property.
in scheme: Thesaurus Multirisque FORESTT
preferred label: adapter les pratiques de gestion et de prévention des risques du propriétaire @fr
was quoted from: Adapté de GIEC (2018) Glossaire. Rapport spécial sur les conséquences d’un réchauffement planétaire de 1,5 °C. [En ligne]. Genève, GIEC. [Consulté le 20/02/2026]. <URL : https://www.ipcc.ch/site/assets/uploads/sites/2/2019/10/SR15_Glossary_french.pdf>. @fr
was quoted from: Adapted from GIEC (2018) Glossaire. Rapport spécial sur les conséquences d’un réchauffement planétaire de 1,5 °C. [En ligne]. Genève, GIEC. [Consulté le 20/02/2026]. <URL : https://www.ipcc.ch/site/assets/uploads/sites/2/2019/10/SR15_Glossary_french.pdf>.

exposed actor of the forest-wood sector
has status: Published
type: Concept
broader: exposed asset of the wood sector
definition: Acteur économique de la filière forêt-bois exposé aux aléas en forêt. @fr
definition: Economic actor of the forest-wood sector exposed to forest hazards.
in scheme: Thesaurus Multirisque FORESTT
narrower: exposed actor of primary processing
narrower: exposed actor of secondary processing
narrower: exposed forest manager
narrower: exposed forest owner
narrower: exposed forestry work contractor
narrower: exposed forest operator
preferred label: acteur exposé de la filière bois @fr
was quoted from: Groupe de travail « Thésaurus du multirisque en forêt » du projet X-RISKS du PEPR FORESTT (ANR-24-PEFO-0005). [En ligne]. <URL : https://www.pepr-forestt.fr/projets/pc-x-risks> @fr

use of accompanying vegetation
has status: Published
type: Concept
broader: physical protection
definition: Gestion des strates basses de la forêt pour favoriser les auxiliaires et la protection physique ou climatique des jeunes arbres. @fr
definition: Management of the lower strata of the forest to favour beneficial organisms and the physical or climatic protection of young trees.
in scheme: Thesaurus Multirisque FORESTT
narrower: associational resistance
preferred label: utilisation de la végétation accompagnatrice @fr
was quoted from: Adapté de Frochot et al. (2022) La gestion de la végétation accompagnatrice : état et perspective. Revue forestière française, 2002, 54(6), pp. 505-520. [En ligne]. [Consulté le 25/03/2026]. <URL : https://hal.science/hal-03449354/document> @fr
was quoted from: Adapted from Frochot et al. (2022) La gestion de la végétation accompagnatrice : état et perspective. Revue forestière française, 2002, 54(6), pp. 505-520. [En ligne]. [Consulté le 25/03/2026]. <URL : https://hal.science/hal-03449354/document>

stand structure
has status: Published
type: Concept
broader: sensitivity related to forest structure
definition: Agencement horizontal et vertical des arbres. @fr
definition: Horizontal and vertical arrangement of trees.
in scheme: Thesaurus Multirisque FORESTT
narrower: structural heterogeneity
narrower: dead branch retention
narrower: vertical fuel continuity
narrower: horizontal fuel continuity
preferred label: structure du peuplement @fr
was quoted from: Adapté de Bouchon (1979) Structure des peuplements forestiers. Annales des Sciences Forestières, 1979, vol. 36, n° 3, pp. 175-209. [En ligne]. [Consulté le 25/03/2026]. <URL : https://www.afs-journal.org/articles/forest/pdf/1979/03/AFS_0003-4312_1979_36_3_ART0001.pdf> @fr
was quoted from: Adapted from Bouchon (1979) Structure des peuplements forestiers. Annales des Sciences Forestières, 1979, vol. 36, n° 3, pp. 175-209. [En ligne]. [Consulté le 25/03/2026]. <URL : https://www.afs-journal.org/articles/forest/pdf/1979/03/AFS_0003-4312_1979_36_3_ART0001.pdf>

risk pooling
has status: Published
type: Concept
broader: forest insurance
definition: Sharing of risk between several forest owners or actors, underlying the principle of insurance, materialised by the distribution of loss costs among members of a group of policyholders so that each pays a contribution proportional to the probability of occurrence of a common risk.
definition: Partage des risques entre plusieurs propriétaires ou acteurs forestiers à la base du principe de l'assurance, se concrétisant par la répartition des coûts des sinistres entre les membres d’un groupe d’assurés afin que chacun paie une cotisation proportionnelle à la probabilité de survenue d’un risque commun. @fr
in scheme: Thesaurus Multirisque FORESTT
preferred label: mutualisation @fr
was quoted from: Adapted from Courtage-Assurance.org. Parcelle de bois : faut-il l’assurer ? [En ligne]. Courtage-Assurance.org. [Consulté le 25/03/2026]. <URL : https://www.courtage-assurance.org/parcelle-de-bois-faut-il-l-assurer/>
was quoted from: Adapté de Courtage-Assurance.org. Parcelle de bois : faut-il l’assurer ? [En ligne]. Courtage-Assurance.org. [Consulté le 25/03/2026]. <URL : https://www.courtage-assurance.org/parcelle-de-bois-faut-il-l-assurer/> @fr

compound risks
has status: Published
type: Concept
alternative label: compound interactions
alternative label: evènements composés @fr
alternative label: intéractions composées @fr
alternative label: compound events
broader: multi-risk
definition: Risques créés par la combinaison de plusieurs facteurs et/ou plusieurs aléas, qu'ils soient simultanés ou en cascade. @fr
definition: Risks created by the combination of several factors and/or several hazards, whether simultaneous or cascading.
in scheme: Thesaurus Multirisque FORESTT
preferred label: risques composés @fr
was quoted from: Adapté de Field et al. (2012). Managing the Risks of Extreme Events and Disasters to Advance Climate Change Adaptation. Cambridge University Press, 582 pp. [En ligne]. [Consulté le 03/06/2026]. <URL : https://www.ipcc.ch/report/managing-the-risks-of-extreme-events-and-disasters-to-advance-climate-change-adaptation/> @fr
was quoted from: Adapted from Field et al. (2012). Managing the Risks of Extreme Events and Disasters to Advance Climate Change Adaptation. Cambridge University Press, 582 pp. [En ligne]. [Consulté le 03/06/2026]. <URL : https://www.ipcc.ch/report/managing-the-risks-of-extreme-events-and-disasters-to-advance-climate-change-adaptation/>

mudflow
has status: Published
type: Concept
broader: torrential hazard
definition: Transport of material in a more or less fluid form on a slope, resulting from the degeneration of certain landslides combined with water inflow.
definition: Transport de matériaux sous forme plus ou moins fluide sur pente par dégénérescence de certains glissements avec afflux d'eau. @fr
in scheme: Thesaurus Multirisque FORESTT
preferred label: coulée de boue @fr
was quoted from: Adapted from Ministère de la Transition écologique. Les mouvements de terrain. 2026. [En ligne]. Ministère de la Transition écologique. [Consulté le 07/04/2026]. <URL : https://www.ecologie.gouv.fr/politiques-publiques/mouvements-terrain>
was quoted from: Adapté de Ministère de la Transition écologique. Les mouvements de terrain. 2026. [En ligne]. Ministère de la Transition écologique. [Consulté le 07/04/2026]. <URL : https://www.ecologie.gouv.fr/politiques-publiques/mouvements-terrain> @fr

early budburst
has status: Published
type: Concept
broader: species-specific sensitivity
definition: Éclatement des bourgeons trop tôt dans la saison exposant les arbres aux gelées tardives. @fr
definition: Bud burst occurring too early in the season, exposing trees to late frosts.
in scheme: Thesaurus Multirisque FORESTT
preferred label: débourrement précoce @fr
was quoted from: Adapté de WSL. La floraison et le débourrement des arbres toujours plus précoces avec l’accélération du changement climatique. News WSL, 6 avril 2022. [En ligne]. [Consulté le 01/07/2026]. <URL : https://www.wsl.ch/fr/news/la-floraison-et-le-debourrement-des-arbres-toujours-plus-precoces-avec-lacceleration-du-changement-climatique/> @fr
was quoted from: Adapted from WSL. La floraison et le débourrement des arbres toujours plus précoces avec l’accélération du changement climatique. News WSL, 6 avril 2022. [En ligne]. [Consulté le 01/07/2026]. <URL : https://www.wsl.ch/fr/news/la-floraison-et-le-debourrement-des-arbres-toujours-plus-precoces-avec-lacceleration-du-changement-climatique/>

high LAI (leaf area index)
has status: Published
type: Concept
broader: stand density
definition: Forte surface foliaire augmentant la transpiration du peuplement forestier. @fr
definition: High leaf area increasing the transpiration of the forest stand.
in scheme: Thesaurus Multirisque FORESTT
preferred label: fort lai (leaf area index) @fr
was quoted from: Adapté de Earthdata NASA. [En ligne]. [Consulté le 20/02/2026]. <URL : https://www.earthdata.nasa.gov/topics/biosphere/leaf-area-index>. @fr
was quoted from: Adapted from Earthdata NASA. [En ligne]. [Consulté le 20/02/2026]. <URL : https://www.earthdata.nasa.gov/topics/biosphere/leaf-area-index>.

redundancy
has status: Published
type: Concept
broader: vulnerability of forestry work companies
definition: Vulnérabilité des entreprises de travaux forestiers liée aux licenciements économiques. @fr
definition: Vulnerability of forestry work companies related to economic layoffs.
in scheme: Thesaurus Multirisque FORESTT
preferred label: licenciement @fr
was quoted from: Groupe de travail « Thésaurus du multirisque en forêt » du projet X-RISKS du PEPR FORESTT (ANR-24-PEFO-0005). [En ligne]. <URL : https://www.pepr-forestt.fr/projets/pc-x-risks> @fr

exposed asset of the wood sector
has status: Published
type: Concept
alternative label: acteur exposé de la filière bois et dommages pour l'acteur @fr
alternative label: exposed actor of the wood sector and damage to the actor
broader: risk to the wood sector
definition: Elément vulnérable du système filière forêt-bois tel qu'une personne, une organisation humaine, un bien matériel, ou une composante du milieu naturel (faune, flore, ressources naturelles…) susceptible de subir des dommages, du fait de son exposition à des aléas. @fr
definition: Vulnerable element of the forest-wood sector system, such as a person, a human organisation, a material asset, or a component of the natural environment (fauna, flora, natural resources...) likely to suffer damage due to exposure to hazards.
in scheme: Thesaurus Multirisque FORESTT
narrower: exposed actor of the forest-wood sector
narrower: loss for the wood sector
preferred label: enjeu exposé de la filière bois @fr
was quoted from: Adapté de Ineris. Définitions des concepts de base du risque accidentel. [En ligne]. Institut national de l'environnement industriel et des risques. [Consulté le 07/04/2026]. <URL : https://www.ineris.fr/fr/risques/comment-evaluer-risque/composantes-risque/definitions-concepts-base-risque-accidentel> @fr
was quoted from: Adapted from Ineris. Définitions des concepts de base du risque accidentel. [En ligne]. Institut national de l'environnement industriel et des risques. [Consulté le 07/04/2026]. <URL : https://www.ineris.fr/fr/risques/comment-evaluer-risque/composantes-risque/definitions-concepts-base-risque-accidentel>

individual mechanical protection system
has status: Published
type: Concept
alternative label: physical protection of the plant
alternative label: protection physique du plant @fr
broader: physical protection
definition: Méthode de protection individuelle des jeunes arbres contre les dégâts d'insectes, de rongeurs ou de grands ongulés. @fr
definition: Method of individual protection of young trees against damage from insects, rodents or large ungulates.
in scheme: Thesaurus Multirisque FORESTT
preferred label: système mécanique de protection individuelle @fr
was quoted from: Adapted from CNPF Grand Est. Chasse et équilibre forêt-gibier. [En ligne]. Centre National de la Propriété Forestière - Grand Est. [Consulté le 25/03/2026]. <URL : https://grandest.cnpf.fr/la-gestion-durable/gestion-des-risques/chasse-et-equilibre-foret-gibier>
was quoted from: Adapté de CNPF Grand Est. Chasse et équilibre forêt-gibier. [En ligne]. Centre National de la Propriété Forestière - Grand Est. [Consulté le 25/03/2026]. <URL : https://grandest.cnpf.fr/la-gestion-durable/gestion-des-risques/chasse-et-equilibre-foret-gibier> @fr

regulation of ungulate populations
has status: Published
type: Concept
alternative label: chasse @fr
alternative label: hunting
broader: curative management, direct control
definition: Hunting practices favourable to the forest-wildlife balance.
definition: Pratiques cynégétiques favorables à l’équilibre forêt-gibier. @fr
in scheme: Thesaurus Multirisque FORESTT
preferred label: régulation des populations d’ongulés @fr
was quoted from: Adapted from CNPF Grand Est. Chasse et équilibre forêt-gibier. [En ligne]. Centre National de la Propriété Forestière - Grand Est. [Consulté le 25/03/2026]. <URL : https://grandest.cnpf.fr/la-gestion-durable/gestion-des-risques/chasse-et-equilibre-foret-gibier>
was quoted from: Adapté de CNPF Grand Est. Chasse et équilibre forêt-gibier. [En ligne]. Centre National de la Propriété Forestière - Grand Est. [Consulté le 25/03/2026]. <URL : https://grandest.cnpf.fr/la-gestion-durable/gestion-des-risques/chasse-et-equilibre-foret-gibier> @fr

foliar fungal disease
has status: Published
type: Concept
broader: fungal phytopathogenic agent
definition: Organisme fongique provoquant des dégâts sur les feuilles. @fr
definition: Fungal organism causing damage to leaves.
in scheme: Thesaurus Multirisque FORESTT
preferred label: maladie fongique foliaires @fr
was quoted from: Adapté de EPHYTIA-INRAE. Champignons foliaires. [En ligne]. [Consulté le 20/02/2026]. <URL : http://ephytia.inra.fr/fr/C/18684/Forets-Champignons-foliaires>. @fr
was quoted from: Adapted from EPHYTIA-INRAE. Champignons foliaires. [En ligne]. [Consulté le 20/02/2026]. <URL : http://ephytia.inra.fr/fr/C/18684/Forets-Champignons-foliaires>.

grey stage
has status: Published
type: Concept
broader: damage characterisation
definition: Defoliation stage after bark beetle attack, where needles have fallen to the ground.
definition: Stade de défoliation après attaque de scolyte où les aiguilles sont tombées au sol. @fr
in scheme: Thesaurus Multirisque FORESTT
preferred label: stade gris @fr
was quoted from: Boutte (2024) Risques multiples et santé des forêts. DSF. [En ligne]. Paris, Ministère de l’Agriculture et de la Souveraineté alimentaire. [Consulté le 20/02/2026]. <URL : https://agriculture.gouv.fr/telecharger/144517>.

regulation of access to forest massifs
has status: Published
type: Concept
broader: regulatory measure
definition: Arrêté préfectoral régementant l'accès aux massifs en fonction du niveau quotidien de danger d'incendie encouru, afin de protéger les personnes et prévenir les éparts de feu accidentels. @fr
definition: Prefectural order regulating access to forest massifs according to the daily fire danger level, in order to protect people and prevent accidental fire outbreaks.
in scheme: Thesaurus Multirisque FORESTT
preferred label: réglementation de l'accès aux massifs forestiers @fr
was quoted from: Adapté de Observatoire des forêts françaises. Évaluer le niveau de risque. [En ligne]. Ministère de l’Agriculture et de la Souveraineté alimentaire - Observatoire des forêts françaises. [Consulté le 25/03/2026]. <URL : https://observatoire.foret.gouv.fr/themes/evaluer-le-niveau-de-risque> @fr
was quoted from: Adapted from Observatoire des forêts françaises. Évaluer le niveau de risque. [En ligne]. Ministère de l’Agriculture et de la Souveraineté alimentaire - Observatoire des forêts françaises. [Consulté le 25/03/2026]. <URL : https://observatoire.foret.gouv.fr/themes/evaluer-le-niveau-de-risque>

early thaw
has status: Published
type: Concept
broader: frost
definition: Melting of snow and ice at the soil surface occurring early in the season.
definition: Fonte de la neige et de la glace en surface du sol survenant tôt dans la saison. @fr
in scheme: Thesaurus Multirisque FORESTT
preferred label: dégel précoce @fr
was quoted from: Adapted from Aquaportail. Dégel. [En ligne]. [Consulté le 20/02/2026]. <URL : https://www.aquaportail.com/dictionnaire/definition/13137/degel>.
was quoted from: Adapté de Aquaportail. Dégel. [En ligne]. [Consulté le 20/02/2026]. <URL : https://www.aquaportail.com/dictionnaire/definition/13137/degel>. @fr

biological control
has status: Published
type: Concept
broader: curative management, direct control
definition: Utilisation d’agents biologiques (insectes, micro-organismes et/ou métabolites microbiens) contre les acariens, les autres ravageurs et les agents pathogènes des plantes et contre les organismes responsables de la putréfaction. @fr
definition: Use of biological agents (insects, micro-organisms and/or microbial metabolites) against mites, other pests and plant pathogens, and against organisms responsible for decay.
in scheme: Thesaurus Multirisque FORESTT
narrower: stump treatment
narrower: conservation biological control
narrower: classical biological control
narrower: installation of tit nest boxes
preferred label: lutte biologique @fr
was quoted from: Adapté de van Lenteren (2012). The state of commercial augmentative biological control: plenty of natural enemies, but a frustrating lack of uptake. BioControl, 57(1), pp. 1-20. @fr
was quoted from: Adapted from van Lenteren (2012). The state of commercial augmentative biological control: plenty of natural enemies, but a frustrating lack of uptake. BioControl, 57(1), pp. 1-20.

presence of flammable compounds
has status: Published
type: Concept
broader: high combustibility
definition: Presence of volatile organic compounds increasing flammability.
definition: Présence de composés organiques volatils augmentant l’inflammabilité. @fr
in scheme: Thesaurus Multirisque FORESTT
preferred label: présence de composés inflammables @fr
was quoted from: Adapté de Moos et al. (2018). Ecosystem-based disaster risk reduction in mountains. Earth-Science Reviews, 177, pp. 497-513. [En ligne]. [Consulté le 03/06/2026]. <URL : https://doi.org/10.1016/j.earscirev.2017.12.011> @fr
was quoted from: Adapted from Moos et al. (2018). Ecosystem-based disaster risk reduction in mountains. Earth-Science Reviews, 177, pp. 497-513. [En ligne]. [Consulté le 03/06/2026]. <URL : https://doi.org/10.1016/j.earscirev.2017.12.011>

small rodent
has status: Published
type: Concept
broader: rodent
definition: Small rodent with epidemic dynamics causing localised damage.
definition: Petit rongeur à dynamiques épidémiques causant des dommages localisés. @fr
in scheme: Thesaurus Multirisque FORESTT
preferred label: microrongeur @fr
was quoted from: Adapted from Caroulle et al. (2006) Dégâts de rongeurs en forêt. [En ligne]. [Consulté le 20/02/2026]. <URL : https://hal.science/hal-03449769v1/file/449_462_CAROULLE.qxd.pdf>.
was quoted from: Adapté de Caroulle et al. (2006) Dégâts de rongeurs en forêt. [En ligne]. [Consulté le 20/02/2026]. <URL : https://hal.science/hal-03449769v1/file/449_462_CAROULLE.qxd.pdf>. @fr

management of invasive alien plant species
has status: Published
type: Concept
broader: curative silvicultural action
definition: Gestion des espèces exotiques envahissantes végétales. @fr
definition: Management of invasive alien plant species.
in scheme: Thesaurus Multirisque FORESTT
preferred label: gestion des EEE végétales @fr
was quoted from: MEEM. [En ligne]. Paris, Ministère de l’Environnement. [Consulté le 20/02/2026]. <URL : https://www.ecologie.gouv.fr/politiques-publiques/especes-exotiques-envahissantes>. @fr

indicator monitoring
has status: Published
type: Concept
broader: general surveillance
definition: Suivi régulier d’indicateurs de danger ou de risque pour le grand public ou les professionnels de la forêt. @fr
definition: Regular monitoring of danger or risk indicators for the general public or forestry professionals.
in scheme: Thesaurus Multirisque FORESTT
preferred label: suivi d'indicateurs @fr
was quoted from: Adapté de Observatoire des forêts françaises. Évaluer le niveau de risque. 2024. [En ligne]. Observatoire des forêts françaises. [Consulté le 02/04/2026]. <URL : https://observatoire.foret.gouv.fr/themes/evaluer-le-niveau-de-risque> @fr
was quoted from: Adapted from Observatoire des forêts françaises. Évaluer le niveau de risque. 2024. [En ligne]. Observatoire des forêts françaises. [Consulté le 02/04/2026]. <URL : https://observatoire.foret.gouv.fr/themes/evaluer-le-niveau-de-risque>

trunk damage
has status: Published
type: Concept
broader: damage characterisation
definition: Lesion, breakage or burn to the trunk.
definition: Lésion, cassure ou brûlure du tronc. @fr
in scheme: Thesaurus Multirisque FORESTT
preferred label: dommage au tronc @fr
was quoted from: Adapted from Rigolot (2004) Predicting postfire mortality of Pinus halepensis Mill. and Pinus pinea L. Plant Ecology, 2004, vol. 171, pp. 139-151. [En ligne]. HAL open science, hal-02674211. [Consulté le 25/03/2026]. <URL : https://hal.inrae.fr/hal-02674211>
was quoted from: Adapté de Rigolot (2004) Predicting postfire mortality of Pinus halepensis Mill. and Pinus pinea L. Plant Ecology, 2004, vol. 171, pp. 139-151. [En ligne]. HAL open science, hal-02674211. [Consulté le 25/03/2026]. <URL : https://hal.inrae.fr/hal-02674211> @fr

early detection
has status: Published
type: Concept
alternative label: identification
broader: monitoring
definition: Identification rapide d'un agent biotique susceptible d'altérer la santé ou le fonctionnement d'un écosystème forestier, afin de faciliter une réponse de gestion adaptée. @fr
definition: Rapid identification of a biotic agent likely to impair the health or functioning of a forest ecosystem, in order to facilitate an appropriate management response.
in scheme: Thesaurus Multirisque FORESTT
narrower: sentinel nursery
narrower: multi-pheromone attractant
preferred label: détection précoce @fr
was quoted from: Groupe de travail « Thésaurus du multirisque en forêt » du projet X-RISKS du PEPR FORESTT (ANR-24-PEFO-0005). [En ligne]. <URL : https://www.pepr-forestt.fr/projets/pc-x-risks> @fr

asset
has status: Published
type: Concept
broader: urban planning sector
definition: Bien matériel ou immatériel exposé à un aléa. @fr
definition: Material or immaterial asset exposed to a hazard.
in scheme: Thesaurus Multirisque FORESTT
preferred label: bien @fr
was quoted from: Adapté de GIEC (2018). Glossaire. [En ligne]. Genève, GIEC. [Consulté le 20/02/2026]. <URL : https://www.ipcc.ch/site/assets/uploads/sites/2/2019/10/SR15_Glossary_french.pdf>. @fr
was quoted from: Adapted from GIEC (2018). Glossaire. [En ligne]. Genève, GIEC. [Consulté le 20/02/2026]. <URL : https://www.ipcc.ch/site/assets/uploads/sites/2/2019/10/SR15_Glossary_french.pdf>.

mortality
has status: Published
type: Concept
broader: damage characterisation
definition: Mort d'arbres dans une forêt, éparse dans l'espace et variable dans le temps, attribuable à des causes souvent multiples mais autres que la coupe forestière. @fr
definition: Death of trees in a forest, scattered in space and variable over time, attributable to often multiple causes other than forest harvesting.
in scheme: Thesaurus Multirisque FORESTT
preferred label: mortalité @fr
was quoted from: Groupe de travail « Thésaurus du multirisque en forêt » du projet X-RISKS du PEPR FORESTT (ANR-24-PEFO-0005). [En ligne]. <URL : https://www.pepr-forestt.fr/projets/pc-x-risks> @fr

vulnerability of extensive silvicultural management models
has status: Published
type: Concept
broader: vulnerability of silvicultural management models
definition: Vulnérabilité de la filière forêt-bois liée au modèle de gestion sylvicole extensif. @fr
definition: Vulnerability of the forest-wood sector related to the extensive silvicultural management model.
in scheme: Thesaurus Multirisque FORESTT
preferred label: vulnérabilité des modèles de gestion sylvicole extensive @fr
was quoted from: Groupe de travail « Thésaurus du multirisque en forêt » du projet X-RISKS du PEPR FORESTT (ANR-24-PEFO-0005). [En ligne]. <URL : https://www.pepr-forestt.fr/projets/pc-x-risks> @fr

curative silvicultural action
has status: Published
type: Concept
broader: curative management, direct control
definition: Opération sylvicole réalisée pour corriger un problème survenu dans un peuplement (dépérissement, attaque parasitaire, ...). @fr
definition: Silvicultural operation carried out to correct a problem occurring in a stand (dieback, pest attack, ...).
in scheme: Thesaurus Multirisque FORESTT
narrower: control measure
narrower: sanitary felling
narrower: early harvest
narrower: crisis timber management
narrower: management of invasive alien plant species
preferred label: action sylvicole curative @fr
was quoted from: Adapté de RNCan - Service canadien des forêts. Glossaire forestier : Sylviculture intensive. [En ligne]. 2019. [Consulté le 25/03/2026]. <URL : https://scf.rncan.gc.ca/termes/vue/1054> @fr
was quoted from: Adapted from RNCan - Service canadien des forêts. Glossaire forestier : Sylviculture intensive. [En ligne]. 2019. [Consulté le 25/03/2026]. <URL : https://scf.rncan.gc.ca/termes/vue/1054>

root cambium-feeding insect
has status: Published
type: Concept
broader: root pest insect
definition: Insecte se nourrissant de la zone cambiale des racines. @fr
definition: Insect feeding on the cambial zone of roots.
in scheme: Thesaurus Multirisque FORESTT
preferred label: insecte cambiophage des racines @fr
was quoted from: Adapté de Bouget et al. (2005) Nomenclature des groupes écologiques d’insectes liés au bois. [En ligne]. Paris, Comptes Rendus Biologies. [Consulté le 20/02/2026]. <URL : https://doi.org/10.1016/j.crvi.2005.08.003>. @fr
was quoted from: Adapted from Bouget et al. (2005) Nomenclature des groupes écologiques d’insectes liés au bois. [En ligne]. Paris, Comptes Rendus Biologies. [Consulté le 20/02/2026]. <URL : https://doi.org/10.1016/j.crvi.2005.08.003>.

loss of species habitat
has status: Published
type: Concept
broader: loss of regulating ecosystem service
definition: Reduction in habitats available for forest fauna or flora species.
definition: Réduction des habitats disponibles pour les espèces de la faune ou la flore forestière. @fr
in scheme: Thesaurus Multirisque FORESTT
preferred label: perte d’habitat des espèces @fr
was quoted from: Adapted from Directive 92/43/CEE (Directive Habitats). Version consolidée 2007. [En ligne]. Union européenne. [Consulté le 25/03/2026]. <URL : https://www.natura2000.fr/sites/default/files/directive_habitats_version_consolidee_2007.pdf>
was quoted from: Adapté de Directive 92/43/CEE (Directive Habitats). Version consolidée 2007. [En ligne]. Union européenne. [Consulté le 25/03/2026]. <URL : https://www.natura2000.fr/sites/default/files/directive_habitats_version_consolidee_2007.pdf> @fr

hazard threatening the wood industry
has status: Published
type: Concept
broader: risk to the wood sector
definition: Éventualité d’une tendance ou d’un phénomène physique, naturel ou anthropique, susceptible d’entraîner des dégâts et des pertes touchant la filière forêt-bois. @fr
definition: The potential occurrence of a natural or human-induced physical trend or phenomenon likely to cause damage and loss to the forest-wood sector.
in scheme: Thesaurus Multirisque FORESTT
narrower: economic hazard
narrower: social hazard
narrower: political hazard
narrower: environmental hazard
preferred label: aléa menaçant la filière bois @fr
was quoted from: Adapté de GIEC (2018) Glossaire. Rapport spécial sur les conséquences d’un réchauffement planétaire de 1,5 °C. [En ligne]. Genève, GIEC. [Consulté le 20/02/2026]. <URL : https://www.ipcc.ch/site/assets/uploads/sites/2/2019/10/SR15_Glossary_french.pdf>. @fr
was quoted from: Adapted from GIEC (2018) Glossaire. Rapport spécial sur les conséquences d’un réchauffement planétaire de 1,5 °C. [En ligne]. Genève, GIEC. [Consulté le 20/02/2026]. <URL : https://www.ipcc.ch/site/assets/uploads/sites/2/2019/10/SR15_Glossary_french.pdf>.

scouring
has status: Published
type: Concept
alternative label: bank erosion
alternative label: érosion de berge @fr
broader: torrential hazard
definition: Deepening of a watercourse caused by the impact of flows against an obstacle (bank, bridge pier, building).
definition: Action de surcreusement des eaux, due à la butée des écoulements sur un obstacle (rive, pile de pont, bâtiment). @fr
in scheme: Thesaurus Multirisque FORESTT
preferred label: affouillement @fr

lack of adaptive capacity
has status: Published
type: Concept
alternative label: incapacité à faire face @fr
alternative label: inability to cope
broader: vulnerability of the forest
definition: Faible capacité des acteurs à s’adapter aux changements. @fr
definition: Low capacity of actors to adapt to change.
in scheme: Thesaurus Multirisque FORESTT
narrower: demographic factor
narrower: individual factor
preferred label: manque de capacité d'adaptation @fr
was quoted from: Adapté de Bréda (2023) Vulnérabilité, aléa, adaptation, résilience. [En ligne]. [Consulté le 20/02/2026]. <URL : https://revueforestierefrancaise.agroparistech.fr/article/view/7585>. @fr
was quoted from: Adapted from Bréda (2023) Vulnérabilité, aléa, adaptation, résilience. [En ligne]. [Consulté le 20/02/2026]. <URL : https://revueforestierefrancaise.agroparistech.fr/article/view/7585>.

forest management for risk adaptation and management
has status: Published
type: Concept
broader: response to protect the forest
definition: Stratégies et pratiques de gestion visant à mieux connaître les écosystèmes forestiers pour anticiper les risques liés au changement climatique et faire évoluer les peuplements en place tout en conservant une gestion souple et adaptable. @fr
definition: Management strategies and practices aimed at gaining better knowledge of forest ecosystems in order to anticipate risks related to climate change and evolve existing stands while maintaining flexible and adaptable management.
in scheme: Thesaurus Multirisque FORESTT
narrower: curative management, direct control
narrower: prevention
narrower: monitoring
narrower: forest insurance
narrower: feedback from experience
preferred label: gestion forestière pour l'adaptation et la gestion des risques @fr
was quoted from: Adapté de CNPF. Gestion forestière et changement climatique : quelles stratégies d'adaptation ? [En ligne]. Réseau AFORCE. [Consulté le 01/04/2026]. <URL : https://reseau-aforce.fr/climat-et-foret-que-sait/gestion-forestiere-et-changement-climatique-quelles-strategies-d> @fr
was quoted from: Adapted from CNPF. Gestion forestière et changement climatique : quelles stratégies d'adaptation ? [En ligne]. Réseau AFORCE. [Consulté le 01/04/2026]. <URL : https://reseau-aforce.fr/climat-et-foret-que-sait/gestion-forestiere-et-changement-climatique-quelles-strategies-d>

low moisture content
has status: Published
type: Concept
broader: high combustibility
definition: Teneur en eau faible des feuilles ou des aiguilles favorisant l’inflammation. @fr
definition: Low moisture content of leaves or needles favouring ignition.
in scheme: Thesaurus Multirisque FORESTT
preferred label: faible teneur en eau @fr
was quoted from: Adapté de Revertegat et al. (2025) Synthèse sur la vulnérabilité des peuplements forestiers au feu. Rapport final du projet AFORCE VULNEFEU (Vulnefeu04). [En ligne]. Réseau AFORCE, 2025. [Consulté le 25/03/2026]. <URL : https://www.reseau-aforce.fr/sites/reseau-aforce/files/2025-07/Rapport-Vulnefeu04-compressed.pdf @fr
was quoted from: Adapted from Revertegat et al. (2025) Synthèse sur la vulnérabilité des peuplements forestiers au feu. Rapport final du projet AFORCE VULNEFEU (Vulnefeu04). [En ligne]. Réseau AFORCE, 2025. [Consulté le 25/03/2026]. <URL : https://www.reseau-aforce.fr/sites/reseau-aforce/files/2025-07/Rapport-Vulnefeu04-compressed.pdf

branch and trunk pest insect
has status: Published
type: Concept
broader: pest insect
definition: Insecte se nourrissant des tissus ligneux des branches et des troncs. @fr
definition: Insect feeding on the woody tissue of branches and trunks.
in scheme: Thesaurus Multirisque FORESTT
narrower: wood-boring insect
narrower: xylomycetophagous insect
preferred label: insecte ravageur des branches et troncs @fr
was quoted from: Adapté de Bouget et al. (2005) Nomenclature des groupes écologiques d’insectes liés au bois. [En ligne]. Paris, Comptes Rendus Biologies. [Consulté le 20/02/2026]. <URL : https://doi.org/10.1016/j.crvi.2005.08.003>. @fr
was quoted from: Adapted from Bouget et al. (2005) Nomenclature des groupes écologiques d’insectes liés au bois. [En ligne]. Paris, Comptes Rendus Biologies. [Consulté le 20/02/2026]. <URL : https://doi.org/10.1016/j.crvi.2005.08.003>.

hail
has status: Published
type: Concept
broader: natural hazard
definition: Precipitation of ice particles generally between 5 and 50 mm in diameter.
definition: Précipitation de particules de glace de diamètre généralement compris entre 5 et 50 mm. @fr
in scheme: Thesaurus Multirisque FORESTT
narrower: intense hail
preferred label: grêle @fr
was quoted from: Adapted from WMO (2017) Grêle. [En ligne]. Genève, OMM. [Consulté le 20/02/2026]. <URL : https://cloudatlas.wmo.int/fr/hail.html>.
was quoted from: Adapté de WMO (2017) Grêle. [En ligne]. Genève, OMM. [Consulté le 20/02/2026]. <URL : https://cloudatlas.wmo.int/fr/hail.html>. @fr

multi-risk interactions
has status: Published
type: Concept
broader: multi-risk approach
definition: Interactions spatiales, temporelles ou causales entre risques ou entre composantes de risques. @fr
definition: Spatial, temporal or causal interactions between risks or between risk components.
in scheme: Thesaurus Multirisque FORESTT
preferred label: interactions multirisque @fr
was quoted from: Groupe de travail « Thésaurus du multirisque en forêt » du projet X-RISKS du PEPR FORESTT (ANR-24-PEFO-0005). [En ligne]. <URL : https://www.pepr-forestt.fr/projets/pc-x-risks> @fr

xylomycetophagous insect
has status: Published
type: Concept
broader: branch and trunk pest insect
definition: Insecte se nourrissant des champignons associés au bois. @fr
definition: Insect feeding on fungi associated with wood.
in scheme: Thesaurus Multirisque FORESTT
preferred label: insecte xylomycophage @fr
was quoted from: Adapté de Bouget et al. (2005) Nomenclature des groupes écologiques d’insectes liés au bois. [En ligne]. Paris, Comptes Rendus Biologies. [Consulté le 20/02/2026]. <URL : https://doi.org/10.1016/j.crvi.2005.08.003>. @fr
was quoted from: Adapted from Bouget et al. (2005) Nomenclature des groupes écologiques d’insectes liés au bois. [En ligne]. Paris, Comptes Rendus Biologies. [Consulté le 20/02/2026]. <URL : https://doi.org/10.1016/j.crvi.2005.08.003>.

atmospheric drought
has status: Published
type: Concept
broader: drought
definition: Prolonged rainfall deficit.
definition: Déficit prolongé de précipitations @fr
in scheme: Thesaurus Multirisque FORESTT
narrower: exceptional atmospheric drought
preferred label: sécheresse atmosphérique @fr
was quoted from: Adapted from Shekhar et al. (2023). Long-term changes in forest response to extreme atmospheric dryness. Global Change Biology, 29(18), pp. 5379-5396. [En ligne]. [Consulté le 03/06/2026]. <URL : https://doi.org/10.1111/gcb.16846>
was quoted from: Adapté de Shekhar et al. (2023). Long-term changes in forest response to extreme atmospheric dryness. Global Change Biology, 29(18), pp. 5379-5396. [En ligne]. [Consulté le 03/06/2026]. <URL : https://doi.org/10.1111/gcb.16846> @fr

pollution
has status: Published
type: Concept
broader: anthropogenic hazard
definition: Émission de substances toxiques affectant les végétaux et les sols forestiers. Les pollutions de proximité sont le plus souvent liées à des activités industrielles, sources d’émanations toxiques pour les végétaux. plusieurs agents sont incriminés comme l'anhydride sulfureux, le fluor, les pesticides et herbicides ou encore les sels de déneigement. enfin, le rejet de déchets ménagers et l’abandon d’appareils électroménagers et de mobilier dans les forêts par des personnes peu scrupuleuses sont responsables de la contamination des sols et des cours d’eau des forêts. @fr
definition: Emission of toxic substances affecting forest vegetation and soils. Local pollution is most often linked to industrial activities, which are sources of toxic emissions for plants. Several agents are implicated, such as sulphur dioxide, fluorine, pesticides and herbicides, or de-icing salts. Finally, the dumping of household waste and the abandonment of appliances and furniture in forests by careless individuals is responsible for the contamination of forest soils and watercourses.
in scheme: Thesaurus Multirisque FORESTT
was quoted from: Adapté de EPHYTIA-INRAE & GEMET. [En ligne]. [Consulté le 20/02/2026]. <URL : https://ephytia.inrae.fr/fr/c/18548/forets-pollutions>. @fr
was quoted from: Adapted from EPHYTIA-INRAE & GEMET. [En ligne]. [Consulté le 20/02/2026]. <URL : https://ephytia.inrae.fr/fr/c/18548/forets-pollutions>.

multirisque
type: Collection
in scheme: Thesaurus Multirisque FORESTT
member: multiple risks
member: multi-risk
member: emerging risk
member: combined impacts
member: cascade effect
member: sequential risks
member: feedback cascade
member: natech
member: multiple vulnerabilities
member: multiple hazards
member: cumulative damage
member: simultaneous risks
member: concurrence of hazards
member: coupled effect
member: trigger
member: compound risks
member: multi-risk approach
member: multi-hazard/vulnerability
member: interacting risks
member: correlated risks
member: aggregated risk
member: risk interdependence
member: multi-risk assessment method
member: integrated multi-risk management strategy
member: multi-risk interactions
member: multi-risk measure
member: aggregated risk measure
member: commensurable risks
member: non-commensurable risks
member: multi-hazard
member: multi-vulnerability
member: multi-hazard impact
member: systemic risk
member: systemic failure
member: systemic vulnerability

autres aléas climatiques (ennoyage du système racinaire, vague de chaleur, foudre, gel, grêle, inondation, érosion)
type: Collection
in scheme: Thesaurus Multirisque FORESTT
member: sensitivity related to species composition
member: lightning damage
member: lightning
member: frost
member: soil erosion
member: root system waterlogging
member: flood
member: hail
member: soil salinisation
member: flood duration
member: frost duration
member: frost intensity
member: water level
member: date of occurrence of root system waterlogging
member: duration of root system waterlogging
member: root system waterlogging intensity
member: heatwave duration
member: heatwave intensity
member: date of occurrence of frost
member: flow rate
member: flood zone mapping
member: frost pocket
member: sensitivity related to topography
member: waterlogging of the root system in winter soils
member: hydromorphic soil
member: capillary rise
member: warm site
member: sensitivity related to root phenology
member: sensitivity related to phenology
member: sensitivity related to cambial phenology
member: sensitivity related to sugar management
member: sensitivity related to nitrogen management
member: sensitivity related to leaf phenology
member: near-surface water table depth
member: early thaw
member: early frost
member: late frost
member: severe cold
member: flood risk prevention plan (PPRI)
member: wind erosion of soils
member: water erosion of soils
member: anoxia
member: hypoxia
member: ten-year flood
member: hundred-year flood
member: intense hail

poorly managed stand
has status: Published
type: Concept
broader: sensitivity related to silviculture
definition: Stand whose management does not maintain its vigour and good health.
definition: Peuplement dont la gestion ne permet pas d'en maintenir la vigueur et la bonne santé. @fr
in scheme: Thesaurus Multirisque FORESTT
narrower: trunk wounds
narrower: poor plantation quality
preferred label: peuplement mal géré @fr
was quoted from: Adapted from Boutte (2024) Risques multiples et santé des forêts. DSF. [En ligne]. Paris, Ministère de l’Agriculture et de la Souveraineté alimentaire. [Consulté le 20/02/2026]. <URL : https://agriculture.gouv.fr/telecharger/144517>.
was quoted from: Adapté de Boutte (2024) Risques multiples et santé des forêts. DSF. [En ligne]. Paris, Ministère de l’Agriculture et de la Souveraineté alimentaire. [Consulté le 20/02/2026]. <URL : https://agriculture.gouv.fr/telecharger/144517>. @fr

return period
has status: Published
type: Concept
broader: risk measure
definition: Probable time interval for a natural hazard to recur at an equal or greater intensity, characterising its frequency of occurrence.
definition: Intervalle de temps probable pour qu’un aléa naturel se reproduise à une intensité égale ou supérieure, qui caractérise sa fréquence d'apparition. @fr
in scheme: Thesaurus Multirisque FORESTT
preferred label: temps de retour @fr
was quoted from: Adapted from Salas (2014). Revisiting the concepts of return period and risk for nonstationary hydrologic extreme events. Journal of Hydrologic Engineering, 19(3), pp. 554-568. [En ligne]. [Consulté le 22/06/2026]. <URL : https://doi.org/10.1061/(ASCE)HE.1943-5584.0000820>
was quoted from: Adapté de Salas (2014). Revisiting the concepts of return period and risk for nonstationary hydrologic extreme events. Journal of Hydrologic Engineering, 19(3), pp. 554-568. [En ligne]. [Consulté le 22/06/2026]. <URL : https://doi.org/10.1061/(ASCE)HE.1943-5584.0000820> @fr

systemic failure
has status: Published
type: Concept
broader: emerging risk
definition: Possibilité d'une défaillance collective et mondiale du système terre qui génère des dommages catastrophiques. @fr
definition: Possibility of a collective, global failure of the Earth system generating catastrophic damage.
in scheme: Thesaurus Multirisque FORESTT
preferred label: défaillance systémique @fr
was quoted from: Adapté de UNDRR (2019). Global Assessment Report on Disaster Risk Reduction. [En ligne]. United Nations. [Consulté le 07/04/2026]. <URL : https://discovery.ucl.ac.uk/id/eprint/10087200/1/GAR19%20Distilled_FINAL.pdf> @fr
was quoted from: Adapted from UNDRR (2019). Global Assessment Report on Disaster Risk Reduction. [En ligne]. United Nations. [Consulté le 07/04/2026]. <URL : https://discovery.ucl.ac.uk/id/eprint/10087200/1/GAR19%20Distilled_FINAL.pdf>

vulnerability of the wood sector
has status: Published
type: Concept
broader: risk to the wood sector
definition: Propension ou prédisposition de la filière forêt-bois à subir des pertes. Notion englobant divers concepts et éléments, tels que la sensibilité ou la fragilité et l’incapacité de faire face et de s’adapter. @fr
definition: Propensity or predisposition of the forest-wood sector to suffer losses. A notion encompassing various concepts and elements, such as sensitivity or fragility and the inability to cope and adapt.
in scheme: Thesaurus Multirisque FORESTT
narrower: vulnerability of forestry work companies
narrower: societal and organisational vulnerability
narrower: vulnerability of owners
narrower: vulnerability of processing actors
narrower: inability to manage crisis timber
narrower: vulnerability of silvicultural management models
narrower: vulnerability of support services
preferred label: vulnérabilité de la filière bois @fr
was quoted from: Adapté de GIEC (2018) Glossaire. Rapport spécial sur les conséquences d’un réchauffement planétaire de 1,5 °C. [En ligne]. Genève, GIEC. [Consulté le 20/02/2026]. <URL : https://www.ipcc.ch/site/assets/uploads/sites/2/2019/10/SR15_Glossary_french.pdf>. @fr
was quoted from: Adapted from GIEC (2018) Glossaire. Rapport spécial sur les conséquences d’un réchauffement planétaire de 1,5 °C. [En ligne]. Genève, GIEC. [Consulté le 20/02/2026]. <URL : https://www.ipcc.ch/site/assets/uploads/sites/2/2019/10/SR15_Glossary_french.pdf>.

forest insurance
has status: Published
type: Concept
broader: forest management for risk adaptation and management
definition: A means of managing forest risks and protecting against financial loss through an agreement or contract by which a company or government authority provides compensation cover in the event of accidental loss of forest capital, in exchange for payment of a premium.
definition: Moyen de gérer les risques en forêt et de se protéger contre les pertes financières par un accord ou contrat par lequel une entreprise ou une autorité gouvernementale offre une garantie d'indemnisation en cas de perte accidentel de capital forestier en échange du paiement d'une prime. @fr
in scheme: Thesaurus Multirisque FORESTT
narrower: risk transfer
narrower: multi-risk forest insurance
narrower: risk pooling
preferred label: assurance forestière @fr
was quoted from: Adapted from AGROVOC. Assurance. [En ligne]. FAO. [Consulté le 25/03/2026]. <URL : https://agrovoc.fao.org/browse/agrovoc/fr/page/c_3902>
was quoted from: Adapté de AGROVOC. Assurance. [En ligne]. FAO. [Consulté le 25/03/2026]. <URL : https://agrovoc.fao.org/browse/agrovoc/fr/page/c_3902> @fr

hydromorphic soil
has status: Published
type: Concept
broader: sensitivity related to water conditions
definition: Sol dont la quantité d’eau présente se maintient constamment à un niveau proche de la saturation à cause d'un mauvais drainage. @fr
definition: Soil where the amount of water present is constantly maintained close to saturation due to poor drainage.
in scheme: Thesaurus Multirisque FORESTT
preferred label: sol hydromorphe @fr
was quoted from: Adapté de Baize (2004). Petit lexique de pédologie. INRA Éditions, Paris, 271 p. ISBN 2-7380-114-4. @fr
was quoted from: Adapted from Baize (2004). Petit lexique de pédologie. INRA Éditions, Paris, 271 p. ISBN 2-7380-114-4.

insufficiently thinned stand
has status: Published
type: Concept
broader: stand density
definition: Peuplement dense avec tiges chétives sensibles aux aléas biotiques et abiotiques. @fr
definition: Dense stand with spindly stems susceptible to biotic and abiotic hazards.
in scheme: Thesaurus Multirisque FORESTT
preferred label: peuplement insuffisamment éclairci @fr
was quoted from: Adapté de Zimmersa. Blog forestier. [En ligne]. [Consulté le 20/02/2026]. <URL : https://www.zimmersa.com/blog-forestier/les-eclaircies-resineuses-une-intervention-sylvicole-bien-connue-et-pourtant-pas-assez-pratiquee-n152>. @fr
was quoted from: Adapted from Zimmersa. Blog forestier. [En ligne]. [Consulté le 20/02/2026]. <URL : https://www.zimmersa.com/blog-forestier/les-eclaircies-resineuses-une-intervention-sylvicole-bien-connue-et-pourtant-pas-assez-pratiquee-n152>.

general surveillance
has status: Published
type: Concept
broader: monitoring
definition: Collecter et enregistrer des données sur la présence ou l’absence d’organismes nuisibles lors des actes de gestion courante (descriptions de parcelles, martelages, travaux...) par le repérage de symptômes, de dégâts, d’indices (changement de couleur du houppier, mortalité, présence de pralines ou de coulures de résine, de nids, de pontes...). @fr
definition: Collecting and recording data on the presence or absence of harmful organisms during routine management activities (plot descriptions, tree marking, works...) by identifying symptoms, damage, and indicators (crown colour change, mortality, presence of pitch tubes or resin flow, nests, egg-laying...).
in scheme: Thesaurus Multirisque FORESTT
narrower: spore trapping
narrower: trigger an "exceptional" diagnosis of the current state of the management unit
narrower: hydric network
narrower: French forest fire database (BDIFF)
narrower: forest-weather index (FWI)
narrower: forest weather forecast
narrower: observer network (DSF)
narrower: DSF database
narrower: indicator monitoring
preferred label: surveillance générale @fr
was quoted from: Boutte (2024) Risques multiples et santé des forêts. DSF. [En ligne]. Paris, Ministère de l’Agriculture et de la Souveraineté alimentaire. [Consulté le 20/02/2026]. <URL : https://agriculture.gouv.fr/telecharger/144517>.

growth cessation
has status: Published
type: Concept
broader: damage characterisation
definition: Arrêt complet de la croissance radiale ou apicale due à la sécheresse. @fr
definition: Complete stop of radial or apical growth caused by drought.
in scheme: Thesaurus Multirisque FORESTT
preferred label: arrêt de croissance @fr
was quoted from: Groupe de travail « Thésaurus du multirisque en forêt » du projet X-RISKS du PEPR FORESTT (ANR-24-PEFO-0005). [En ligne]. <URL : https://www.pepr-forestt.fr/projets/pc-x-risks> @fr

sensitivity related to leaf phenology
has status: Published
type: Concept
broader: sensitivity related to phenology
definition: Extent to which a forest species is affected by a hazard due to its budburst and leaf fall schedule.
definition: Mesure dans laquelle une espèce forestière est affectée par un aléa du fait de son calendrier de débourrement et chute des feuilles. @fr
in scheme: Thesaurus Multirisque FORESTT
preferred label: sensibilité liée à la phénologie foliaire @fr
was quoted from: Adapté de TEMPO. Observatoire Forêts. [En ligne]. TEMPO (Réseau national d’observation de la phénologie). [Consulté le 25/03/2026]. <URL : https://tempo.pheno.fr/observatoires/observatoire-forets> @fr
was quoted from: Adapted from TEMPO. Observatoire Forêts. [En ligne]. TEMPO (Réseau national d’observation de la phénologie). [Consulté le 25/03/2026]. <URL : https://tempo.pheno.fr/observatoires/observatoire-forets>

targeted monitoring
has status: Published
type: Concept
broader: monitoring
definition: Surveillance sanitaire en forêt orientée vers un organisme nuisible particulièrement péroccupant qui requiert une attention prioritaire. @fr
definition: Forest health monitoring focused on a particularly concerning harmful organism requiring priority attention.
in scheme: Thesaurus Multirisque FORESTT
preferred label: surveillance ciblée @fr
was quoted from: Adapté de Plateforme ESV. Surveillance. [En ligne]. Plateforme d'Épidémiosurveillance en Santé Végétale. [Consulté le 02/04/2026]. <URL : https://plateforme-esv.fr/expertises/surveillance> @fr
was quoted from: Adapted from Plateforme ESV. Surveillance. [En ligne]. Plateforme d'Épidémiosurveillance en Santé Végétale. [Consulté le 02/04/2026]. <URL : https://plateforme-esv.fr/expertises/surveillance>

snow depth
has status: Published
type: Concept
broader: hazard characterisation
definition: Épaisseur de neige accumulée. @fr
definition: Thickness of accumulated snow.
in scheme: Thesaurus Multirisque FORESTT
preferred label: hauteur de neige @fr
was quoted from: Adapté de Météo France. [En ligne]. Toulouse, Météo France. [Consulté le 20/02/2026]. <URL : https://www.france-montagnes.com/enneigement-bulletins-neige/> @fr
was quoted from: Adapted from Météo France. [En ligne]. Toulouse, Météo France. [Consulté le 20/02/2026]. <URL : https://www.france-montagnes.com/enneigement-bulletins-neige/>

rewilding
has status: Published
type: Concept
alternative label: rewildling @fr
broader: curative management, direct control
definition: Processus de reconstruction d’un écosystème naturel après arrêt des perturbations humaines, en restaurant ses fonctions et chaînes alimentaires notamment par le retour des grands prédateurs. @fr
definition: Process of rebuilding a natural ecosystem after human disturbances cease, restoring its functions and food chains, in particular through the return of large predators.
in scheme: Thesaurus Multirisque FORESTT
preferred label: ré-ensauvagement @fr
was quoted from: Adapté de Dutoit et al. (2024) Restaurer ou réensauvager la nature ? [En ligne]. [Consulté le 25/03/2026]. <URL: https://hal.univ-lorraine.fr/IMBE-EECAR/hal-04833505v1> @fr
was quoted from: Adapted from Dutoit et al. (2024) Restaurer ou réensauvager la nature ? [En ligne]. [Consulté le 25/03/2026]. <URL: https://hal.univ-lorraine.fr/IMBE-EECAR/hal-04833505v1>

challenging of silvicultural models
has status: Published
type: Concept
broader: rise in societal tensions
definition: Criticism of intensive silvicultural management.
definition: Critique de la gestion sylviciole intensive. @fr
in scheme: Thesaurus Multirisque FORESTT
preferred label: remise en cause des modèles sylvicoles @fr
was quoted from: Adapté de WWF France. Enchantées ou désenchantées : quelles forêts françaises en 2100 ? 2025. [En ligne]. WWF. [Consulté le 07/04/2026]. <URL : https://www.wwf.fr/sites/default/files/doc-2025-03/FORETS%20ENCHANTE%CC%81ES%20FINAL%20BASSE%20DEF.pdf> @fr
was quoted from: Adapted from WWF France. Enchantées ou désenchantées : quelles forêts françaises en 2100 ? 2025. [En ligne]. WWF. [Consulté le 07/04/2026]. <URL : https://www.wwf.fr/sites/default/files/doc-2025-03/FORETS%20ENCHANTE%CC%81ES%20FINAL%20BASSE%20DEF.pdf>

severe risk
has status: Published
type: Concept
broader: qualitative risk assessment
definition: Niveau de risque jugé critique, en général de valeur 4/5. @fr
definition: Risk level judged critical, generally rated 4/5.
in scheme: Thesaurus Multirisque FORESTT
preferred label: risque sévère @fr
was quoted from: Adapté de Vaysse (2019) Méthodes de détermination du danger météorologique d’incendie dans le sud de la France. Forêt méditerranéenne, XL(2), pp. 193-200. [En ligne]. [Consulté le 25/03/2026]. <URL : https://www.foret-mediterraneenne.org/upload/biblio/FORET_MED_2019_2_193-200.pdf> @fr
was quoted from: Adapted from Vaysse (2019) Méthodes de détermination du danger météorologique d’incendie dans le sud de la France. Forêt méditerranéenne, XL(2), pp. 193-200. [En ligne]. [Consulté le 25/03/2026]. <URL : https://www.foret-mediterraneenne.org/upload/biblio/FORET_MED_2019_2_193-200.pdf>

choice of target species
has status: Published
type: Concept
broader: forest planning for risk adaptation and management
definition: Sélection d’essences forestières cibles adaptées au climat et aux risques futurs. @fr
definition: Selection of target forest species adapted to climate and future risks.
in scheme: Thesaurus Multirisque FORESTT
preferred label: choix des essences objectifs @fr
was quoted from: Adapté de Legay (2019) Adapter les forêts du Grand Est au changement climatique : Comment choisir les essences-objectifs. [En ligne]. INRAE. [Consulté le 01/04/2026]. <URL : https://renfor.hub.inrae.fr/content/download/3925/36598?version=1> @fr
was quoted from: Adapted from Legay (2019) Adapter les forêts du Grand Est au changement climatique : Comment choisir les essences-objectifs. [En ligne]. INRAE. [Consulté le 01/04/2026]. <URL : https://renfor.hub.inrae.fr/content/download/3925/36598?version=1>

flame front
has status: Published
type: Concept
alternative label: panneau radiant @fr
alternative label: radiant panel
broader: hazard characterisation
definition: La partie active d'un incendie dans laquelle se déroule en continue une combustion avec flammes. @fr
definition: The active part of a fire in which flaming combustion takes place continuously.
in scheme: Thesaurus Multirisque FORESTT
preferred label: front de flammes @fr

multi-hazard/vulnerability
has status: Published
type: Concept
broader: multi-risk
definition: Approche combinant multi-aléas et multi-vulnérabilité. @fr
definition: Approach combining multi-hazard and multi-vulnerability.
in scheme: Thesaurus Multirisque FORESTT
narrower: multi-hazard
narrower: multi-vulnerability
preferred label: multi-aléa/vulnerabilité @fr
was quoted from: Adapté de Curt (2020) Multirisque : quelles orientations de recherche dans les travaux récents ?[En ligne]. [Consulté le 20/02/2026]. <URL : https://hal.science/hal-03462813/document>. @fr
was quoted from: Adapted from Curt (2020) Multirisque : quelles orientations de recherche dans les travaux récents ?[En ligne]. [Consulté le 20/02/2026]. <URL : https://hal.science/hal-03462813/document>.

rise in societal tensions
has status: Published
type: Concept
alternative label: conflit forêt-société @fr
alternative label: forest-society conflict
broader: social hazard
definition: Erosion of the forest-society relationship and increase in conflict between stakeholders.
definition: Effritement du lien forêt-société et augmentation de la conflictualité entre les acteurs. @fr
in scheme: Thesaurus Multirisque FORESTT
narrower: challenging of silvicultural models
preferred label: augmentation des tensions sociétales @fr
was quoted from: Adapté de WWF France. Enchantées ou désenchantées : quelles forêts françaises en 2100 ? 2025. [En ligne]. WWF. [Consulté le 07/04/2026]. <URL : https://www.wwf.fr/sites/default/files/doc-2025-03/FORETS%20ENCHANTE%CC%81ES%20FINAL%20BASSE%20DEF.pdf> @fr
was quoted from: Adapted from WWF France. Enchantées ou désenchantées : quelles forêts françaises en 2100 ? 2025. [En ligne]. WWF. [Consulté le 07/04/2026]. <URL : https://www.wwf.fr/sites/default/files/doc-2025-03/FORETS%20ENCHANTE%CC%81ES%20FINAL%20BASSE%20DEF.pdf>

duration of root system waterlogging
has status: Published
type: Concept
broader: hazard characterisation
definition: Période mesurable pendant laquelle le sol reste saturé en eau. @fr
definition: Measurable period during which the soil remains saturated with water.
in scheme: Thesaurus Multirisque FORESTT
preferred label: durée d'engorgement du système racinaire @fr
was quoted from: Adapté de ONF (2005) RDVT 73-22-28. [En ligne]. [Consulté le 20/02/2026]. <URL : https://old.foretnature.be/images/stories/pdffolder/FO163-SOLS-BIBLIO-6-ONF_RDVT_73-22-28.pdf>. @fr
was quoted from: Adapted from ONF (2005) RDVT 73-22-28. [En ligne]. [Consulté le 20/02/2026]. <URL : https://old.foretnature.be/images/stories/pdffolder/FO163-SOLS-BIBLIO-6-ONF_RDVT_73-22-28.pdf>.

difficulty for forestry work companies in negotiating fair prices
has status: Published
type: Concept
broader: vulnerability of forestry work companies
definition: Vulnérabilité des entreprises de travaux forestiers (ETF) liée à la difficulté à négocier des prix équitables, notamment lorsqu'il s'agit d'Entreprise Unipersonnelle à Responsabilité Limitée (EURL) ou qu'elles agissent en sous-traitance d'autres acteurs de la filière forêt-bois. @fr
definition: Vulnerability of forestry work companies (FWCs) related to the difficulty of negotiating fair prices, particularly when they are single-member limited liability companies (EURL) or act as subcontractors for other forest-wood sector actors.
in scheme: Thesaurus Multirisque FORESTT
preferred label: difficulté pour les entreprises de travaux forestiers de négocier des prix équitables @fr
was quoted from: Adapté de Gremillet. Situation particulièrement préoccupante des entreprises de travaux et services agricoles, ruraux et forestiers dans le Grand Est, et plus spécifiquement dans le département des Vosges. Question écrite n° 08049. [En ligne]. Sénat français, 12 mars 2026. [Consulté le 25/03/2026]. <URL : https://www.senat.fr/questions/base/2026/qSEQ260308049.html> @fr
was quoted from: Adapted from Gremillet. Situation particulièrement préoccupante des entreprises de travaux et services agricoles, ruraux et forestiers dans le Grand Est, et plus spécifiquement dans le département des Vosges. Question écrite n° 08049. [En ligne]. Sénat français, 12 mars 2026. [Consulté le 25/03/2026]. <URL : https://www.senat.fr/questions/base/2026/qSEQ260308049.html>

coupled effect
has status: Published
type: Concept
broader: sequential risks
definition: Effet résultant de l'interaction entre deux aléas. @fr
definition: Effect resulting from the interaction between two hazards.
in scheme: Thesaurus Multirisque FORESTT
preferred label: effet couplé @fr
was quoted from: Adapté de Csilléry et al. (2017). Coupled effects of wind-storms and drought on tree mortality across 115 forest stands from the Western Alps and the Jura mountains. Global Change Biology, 23(12), pp. 5092-5107. [En ligne]. [Consulté le 03/06/2026]. <URL : https://doi.org/10.1111/gcb.13773> @fr
was quoted from: Adapted from Csilléry et al. (2017). Coupled effects of wind-storms and drought on tree mortality across 115 forest stands from the Western Alps and the Jura mountains. Global Change Biology, 23(12), pp. 5092-5107. [En ligne]. [Consulté le 03/06/2026]. <URL : https://doi.org/10.1111/gcb.13773>

trunk wounds
has status: Published
type: Concept
broader: poorly managed stand
definition: Mechanical lesions generally related to silvicultural operations, facilitating pathogen entry.
definition: Lésions mécaniques liées en général aux travaux sylvicoles favorisant l’entrée de pathogènes. @fr
in scheme: Thesaurus Multirisque FORESTT
preferred label: blessures des troncs @fr
was quoted from: Adapted from Arbres.ccdmd.qc.ca. [En ligne]. [Consulté le 20/02/2026]. <URL : http://arbres.ccdmd.qc.ca/fiche/blessures-mecaniques>.
was quoted from: Adapté de Arbres.ccdmd.qc.ca. [En ligne]. [Consulté le 20/02/2026]. <URL : http://arbres.ccdmd.qc.ca/fiche/blessures-mecaniques>. @fr

protection forest mapping
has status: Published
type: Concept
broader: governance measure
definition: Cartographie des massifs forestiers classés en forêts de protection. @fr
definition: Mapping of forest massifs classified as protection forests.
in scheme: Thesaurus Multirisque FORESTT
preferred label: cartographie des forêts de protection @fr
was quoted from: Adapté de Dupire et Toe (2022). Cartographie indicative à l’échelle départementale des aléas rocheux et des forêts à fonction de protection. Dataset SylvaRock. Recherche Data Gouv, DOI : 10.15454/O93984. [Consulté le 25/03/2026]. <URL : https://doi.org/10.15454/O93984> @fr
was quoted from: Adapted from Dupire et Toe (2022). Cartographie indicative à l’échelle départementale des aléas rocheux et des forêts à fonction de protection. Dataset SylvaRock. Recherche Data Gouv, DOI : 10.15454/O93984. [Consulté le 25/03/2026]. <URL : https://doi.org/10.15454/O93984>

root and collar pathogen
has status: Published
type: Concept
broader: fungal phytopathogenic agent
definition: Organismes fongiques racinaires spécialisés dont les caractéristiques diffèrent fortement selon qu’ils s’attaquent aux grosses ou aux fines racines. @fr
definition: Specialized root-infecting fungal organisms whose characteristics differ greatly depending on whether they attack large or fine roots.
in scheme: Thesaurus Multirisque FORESTT
preferred label: agent pathogène des racines et du collet @fr
was quoted from: Adapté de EPHYTIA-INRAE. Champignons racinaires. [En ligne]. [Consulté le 20/02/2026]. <URL : https://ephytia.inrae.fr/fr/C/18687/Forets-Champignons-racinaires>. @fr
was quoted from: Adapted from EPHYTIA-INRAE. Champignons racinaires. [En ligne]. [Consulté le 20/02/2026]. <URL : https://ephytia.inrae.fr/fr/C/18687/Forets-Champignons-racinaires>.

harvest residue with respect to the nematode
has status: Published
type: Concept
alternative label: copeaux @fr
alternative label: chips
broader: sensitive host
definition: Wood left on site after harvesting that may harbour the nematode.
definition: Bois laissé sur place après coupe pouvant héberger le nématode. @fr
in scheme: Thesaurus Multirisque FORESTT
preferred label: rémanent de coupe vis-à-vis du nématode @fr
was quoted from: Adapté de Plan national d'intervention sanitaire d'urgence relatif à Bursaphelenchus xylophilus (nématode du pin). [En ligne]. [Consulté le 20/02/2026]. <URL : https://info.agriculture.gouv.fr/boagri/instruction-2019-209>. @fr
was quoted from: Adapted from Plan national d'intervention sanitaire d'urgence relatif à Bursaphelenchus xylophilus (nématode du pin). [En ligne]. [Consulté le 20/02/2026]. <URL : https://info.agriculture.gouv.fr/boagri/instruction-2019-209>.

exposed forest owner
has status: Published
type: Concept
broader: exposed actor of the forest-wood sector
definition: Propriétaire forestier susceptible de subir des dommages, du fait de son exposition à des aléas. @fr
definition: Forest owner likely to suffer damage due to exposure to hazards.
in scheme: Thesaurus Multirisque FORESTT
preferred label: propriétaire forestier exposé @fr
was quoted from: Groupe de travail « Thésaurus du multirisque en forêt » du projet X-RISKS du PEPR FORESTT (ANR-24-PEFO-0005). [En ligne]. <URL : https://www.pepr-forestt.fr/projets/pc-x-risks> @fr

control line
has status: Published
type: Concept
broader: ground intervention
definition: Terme générique désignant l'ensemble des barrières artificielles ou naturelles et des lisières de feu traitées utilisées pour maîtriser un incendie. @fr
definition: Generic term designating all the artificial or natural barriers and treated fire edges used to control a fire.
in scheme: Thesaurus Multirisque FORESTT
preferred label: ligne d’arrêt @fr

ISPM 15 phytosanitary standard
has status: Published
type: Concept
broader: regulatory measure
definition: Réglementation des matériaux d’emballage en bois utilisés dans le commerce international @fr
definition: Regulation of wood packaging materials used in international trade.
in scheme: Thesaurus Multirisque FORESTT
preferred label: norme phytosanitaire NIMP15 @fr
was quoted from: Adapté de FAO. NIMP 15 - Matériaux d’emballage en bois (Réglementation internationale). 2018. [En ligne]. [Consulté le 25/03/2026]. <URL : https://openknowledge.fao.org/server/api/core/bitstreams/a24ebc56-4e41-436d-bd7b-f8b2fa1423b7/content> @fr
was quoted from: Adapted from FAO. NIMP 15 - Matériaux d’emballage en bois (Réglementation internationale). 2018. [En ligne]. [Consulté le 25/03/2026]. <URL : https://openknowledge.fao.org/server/api/core/bitstreams/a24ebc56-4e41-436d-bd7b-f8b2fa1423b7/content>

vascular fungus
has status: Published
type: Concept
broader: fungal phytopathogenic agent
definition: Organisme fongique se développant dans les vaisseaux du bois. @fr
definition: Fungal organism developing within the wood vessels.
in scheme: Thesaurus Multirisque FORESTT
preferred label: champignon vasculaire @fr
was quoted from: Adapté de EPHYTIA-INRAE. Champignons vasculaires. [En ligne]. [Consulté le 20/02/2026]. <URL : http://ephytia.inra.fr/fr/C/26415/Forets-Champignons-vasculaires>. @fr
was quoted from: Adapted from EPHYTIA-INRAE. Champignons vasculaires. [En ligne]. [Consulté le 20/02/2026]. <URL : http://ephytia.inra.fr/fr/C/26415/Forets-Champignons-vasculaires>.

reproduction deficit
has status: Published
type: Concept
alternative label: lack of seed trees
alternative label: manque de semenciers @fr
broader: demographic factor
definition: Post-disturbance regeneration difficulty due to a lack of seed trees.
definition: Difficulté de régénération post-perturbation du fait d'un manque d'arbres semenciers. @fr
in scheme: Thesaurus Multirisque FORESTT
narrower: strong competition from accompanying vegetation
narrower: sexual immaturity
narrower: non-viable population size
preferred label: déficit de reproduction @fr
was quoted from: Groupe de travail « Thésaurus du multirisque en forêt » du projet X-RISKS du PEPR FORESTT (ANR-24-PEFO-0005). [En ligne]. <URL : https://www.pepr-forestt.fr/projets/pc-x-risks> @fr

heatwave
has status: Published
type: Concept
alternative label: high temperature
alternative label: forte température @fr
alternative label: canicule @fr
broader: natural hazard
definition: Période prolongée de températures anormalement élevées augmentant la transpiration des arbres. @fr
definition: Prolonged period of abnormally high temperatures increasing tree transpiration.
in scheme: Thesaurus Multirisque FORESTT
preferred label: vague de chaleur @fr
was quoted from: Adapté de Météo-France. Canicule, pic ou vague de chaleur : quelles différences ? [En ligne]. [Consulté le 03/06/2026]. <URL : https://meteofrance.com/actualites-et-dossiers/comprendre-la-meteo/canicule-vague-ou-pic-de-chaleur> @fr
was quoted from: Adapted from Météo-France. Canicule, pic ou vague de chaleur : quelles différences ? [En ligne]. [Consulté le 03/06/2026]. <URL : https://meteofrance.com/actualites-et-dossiers/comprendre-la-meteo/canicule-vague-ou-pic-de-chaleur>

extreme risk
has status: Published
type: Concept
broader: qualitative risk assessment
definition: Niveau de risque jugé extrême (5/5), caractéristique des conditions catastrophiques. @fr
definition: Risk level judged extreme (5/5), characteristic of catastrophic conditions.
in scheme: Thesaurus Multirisque FORESTT
preferred label: risque extrême @fr
was quoted from: Adapté de Mignan, Wiemer & Giardini (2014). The quantification of low-probability–high-consequences events: part I. A generic multi-risk approach. Natural Hazards, 73, pp. 1999-2022. [En ligne]. [Consulté le 03/06/2026]. <URL : https://doi.org/10.1007/s11069-014-1178-4> @fr
was quoted from: Adapted from Mignan, Wiemer & Giardini (2014). The quantification of low-probability–high-consequences events: part I. A generic multi-risk approach. Natural Hazards, 73, pp. 1999-2022. [En ligne]. [Consulté le 03/06/2026]. <URL : https://doi.org/10.1007/s11069-014-1178-4>

multiple hazards
has status: Published
type: Concept
broader: multiple risks
definition: All the hazards threatening the exposed assets of the system of interest.
definition: Ensemble des aléas menaçant les enjeux exposés du système d'intérêt. @fr
in scheme: Thesaurus Multirisque FORESTT
preferred label: aléas multiples @fr
was quoted from: Groupe de travail « Thésaurus du multirisque en forêt » du projet X-RISKS du PEPR FORESTT (ANR-24-PEFO-0005). [En ligne]. <URL : https://www.pepr-forestt.fr/projets/pc-x-risks> @fr

energy sector
has status: Published
type: Concept
broader: non-forest asset at risk
definition: Secteur qui englobe les activités liées à la production, la transformation, le transport, la distribution et la consommation de diverses formes d'énergie, incluant les combustibles fossiles et les énergies renouvelables. @fr
definition: Sector encompassing activities related to the production, transformation, transport, distribution and consumption of various forms of energy, including fossil fuels and renewable energies.
in scheme: Thesaurus Multirisque FORESTT
narrower: power line
preferred label: secteur des énergies @fr
was quoted from: Adapté de Wikipédia en français. Secteur énergétique. [En ligne]. Wikimedia Foundation, 2010. [Consulté le 25/03/2026]. <URL : https://fr-academic.com/dic.nsf/frwiki/1523724> @fr
was quoted from: Adapted from Wikipédia en français. Secteur énergétique. [En ligne]. Wikimedia Foundation, 2010. [Consulté le 25/03/2026]. <URL : https://fr-academic.com/dic.nsf/frwiki/1523724>

upstream actor failure
has status: Published
type: Concept
broader: actor failure
definition: Acteur de l'amont de la filière forêt-bois (propriétaire ou entrepreneur forestier) qui ne remplit plus sa fonction d'approvisonnement en matière première, par baisse ou arrêt d'activité. @fr
definition: Upstream forest-wood sector actor (owner or forestry contractor) who no longer fulfils their raw material supply function, due to a decline or cessation of activity.
in scheme: Thesaurus Multirisque FORESTT
preferred label: défaillance d'acteurs amont @fr
was quoted from: Adapté de France Industrie. Filière bois : quels sont les acteurs en France ? [En ligne]. France Industrie. [Consulté le 07/04/2026]. <URL : https://www.france-industrie.pro/quelles-sont-les-entreprises-de-la-filiere-bois-en-france-roles-et-enjeux-de-chaque-maillon-de-lindustrie/> @fr
was quoted from: Adapted from France Industrie. Filière bois : quels sont les acteurs en France ? [En ligne]. France Industrie. [Consulté le 07/04/2026]. <URL : https://www.france-industrie.pro/quelles-sont-les-entreprises-de-la-filiere-bois-en-france-roles-et-enjeux-de-chaque-maillon-de-lindustrie/>

vulnerability
has status: Published
type: Concept
broader: risk component
definition: Propension ou prédisposition à subir des dommages. Notion englobant divers concepts et éléments, tels que la sensibilité ou la fragilité et l’incapacité de faire face et de s’adapter. @fr
definition: Propensity or predisposition to suffer damage. A notion encompassing various concepts and elements, such as sensitivity or fragility and the inability to cope and adapt.
in scheme: Thesaurus Multirisque FORESTT
preferred label: vulnérabilité @fr
was quoted from: GIEC (2018) Glossaire. [En ligne]. Genève, GIEC. [Consulté le 20/02/2026]. <URL : https://www.ipcc.ch/site/assets/uploads/sites/2/2019/10/SR15_Glossary_french.pdf>. @fr

flood
has status: Published
type: Concept
alternative label: crue @fr
broader: natural hazard
definition: Gonflement d’un cours d’eau ou d’une autre masse d’eau au-delà des limites normales ou accumulation d’eau dans des zones qui, en temps normal, ne sont pas submergées. @fr
definition: The rising of a watercourse or other body of water beyond normal limits, or the accumulation of water in areas that are not normally submerged.
in scheme: Thesaurus Multirisque FORESTT
narrower: ten-year flood
narrower: hundred-year flood
preferred label: inondation @fr
was quoted from: GIEC (2018) Glossaire. [En ligne]. Genève, GIEC. [Consulté le 20/02/2026]. <URL : https://www.ipcc.ch/site/assets/uploads/sites/2/2019/10/SR15_Glossary_french.pdf>. @fr

loss of non-wood product supply
has status: Published
type: Concept
alternative label: perte de revenu non bois @fr
alternative label: loss of non-wood income
broader: loss of provisioning service
definition: Réduction de la fourniture en produits tirés de la forêt autre que le bois (gros gibier, noix et graines, petits fruits, champignons, plantes médicinales, le bois de chauffage, etc.) @fr
definition: Reduction in the supply of forest products other than wood (large game, nuts and seeds, berries, mushrooms, medicinal plants, firewood, etc.).
in scheme: Thesaurus Multirisque FORESTT
preferred label: perte en approvisionnement en produit non bois @fr
was quoted from: SCF RNCan. Termes. [En ligne]. Ottawa, SCF RNCan. [Consulté le 20/02/2026]. <URL :https://scf.rncan.gc.ca/termes/vue/814 @fr

pest insect
has status: Published
type: Concept
alternative label: insectes nuisibles @fr
alternative label: harmful insects
broader: plant bioagressor
definition: Insecte causant des dommages importants sur une plante. @fr
definition: Insect causing significant damage to a plant.
in scheme: Thesaurus Multirisque FORESTT
narrower: foliage pest insect
narrower: branch and trunk pest insect
narrower: reproductive organ pest insect
narrower: vector insect
narrower: root pest insect
preferred label: insecte ravageur @fr
was quoted from: Adapté de Belluco et al. (2023). Insects and Public Health: An Overview. Insects, 14(3), 240. [En ligne]. [Consulté le 04/08/2026]. <URL : https://doi.org/10.3390/insects14030240> @fr
was quoted from: Adapted from Belluco et al. (2023). Insects and Public Health: An Overview. Insects, 14(3), 240. [En ligne]. [Consulté le 04/08/2026]. <URL : https://doi.org/10.3390/insects14030240>

diversification of treatments
has status: Published
type: Concept
broader: sustainable management document
definition: Widening the range of operation sequences (thinning, pruning, etc.) carried out in a forest stand to better manage risks.
definition: Elargir la gamme des séquences d'opérations (coupe d'éclaircie, élagage, etc.) réalisées dans un peuplement forestier pour mieux gérer les risques. @fr
in scheme: Thesaurus Multirisque FORESTT
preferred label: diversification des traitements @fr
was quoted from: Adapté de RNCan - Service canadien des forêts. Glossaire forestier : Sylviculture intensive. [En ligne]. 2019. [Consulté le 25/03/2026]. <URL : https://scf.rncan.gc.ca/termes/vue/1054> @fr
was quoted from: Adapted from RNCan - Service canadien des forêts. Glossaire forestier : Sylviculture intensive. [En ligne]. 2019. [Consulté le 25/03/2026]. <URL : https://scf.rncan.gc.ca/termes/vue/1054>

rise in insurance premiums for processing actors
has status: Published
type: Concept
broader: vulnerability of processing actors
definition: Vulnérabilité des acteurs de la transformation forestière liée à la hausse de la prime d'assurance de leur forêt. @fr
definition: Vulnerability of forest processing actors related to the rise in insurance premiums for their forest.
in scheme: Thesaurus Multirisque FORESTT
preferred label: augmentation de la prime d'assurance des acteurs de la transformation @fr
was quoted from: Adapté de Chaize. Difficultés des scieries pour disposer d’une garantie risque incendie. Question écrite n° 19996. Sénat, 2021. [En ligne]. [Consulté le 03/06/2026]. <URL : https://www.senat.fr/questions/base/2021/qSEQ210119996.html> @fr
was quoted from: Adapted from Chaize. Difficultés des scieries pour disposer d’une garantie risque incendie. Question écrite n° 19996. Sénat, 2021. [En ligne]. [Consulté le 03/06/2026]. <URL : https://www.senat.fr/questions/base/2021/qSEQ210119996.html>

snow
has status: Published
type: Concept
broader: natural hazard
definition: Précipitation solide atteignant le sol lorsque la température de l’air est négative ou voisine de 0 °C. @fr
definition: Solid precipitation reaching the ground when air temperature is negative or close to 0 °C.
in scheme: Thesaurus Multirisque FORESTT
narrower: extreme snowfall
preferred label: neige @fr
was quoted from: Préfecture du Nord. Phénomène météo. [En ligne]. Lille, Préfecture du Nord. [Consulté le 20/02/2026]. <URL : https://www.nord.gouv.fr/contenu/telechargement/92573/662172/file/Phenomene-meteo.pdf>. @fr

environmental hazard
has status: Published
type: Concept
broader: hazard threatening the wood industry
definition: The potential occurrence of a natural or human-induced physical trend or phenomenon likely to cause damage and loss to forest ecosystems and the resources they provide to the forest-wood sector.
definition: Éventualité d’une tendance ou d’un phénomène physique, naturel ou anthropique, susceptible d’entraîner des dégâts et des pertes touchant les écosystèmes forestiers et les ressources qu'ils procurent à la filière forêt-bois. @fr
in scheme: Thesaurus Multirisque FORESTT
preferred label: aléa environnemental @fr
was quoted from: Adapté de GIEC (2018) Glossaire. Rapport spécial sur les conséquences d’un réchauffement planétaire de 1,5 °C. [En ligne]. Genève, GIEC. [Consulté le 20/02/2026]. <URL : https://www.ipcc.ch/site/assets/uploads/sites/2/2019/10/SR15_Glossary_french.pdf>. @fr
was quoted from: Adapted from GIEC (2018) Glossaire. Rapport spécial sur les conséquences d’un réchauffement planétaire de 1,5 °C. [En ligne]. Genève, GIEC. [Consulté le 20/02/2026]. <URL : https://www.ipcc.ch/site/assets/uploads/sites/2/2019/10/SR15_Glossary_french.pdf>.

early frost
has status: Published
type: Concept
broader: frost
definition: Gelée survenant en début d’automne avant l’endurcissement des pousses de l’année, pouvant provoquer des dégâts sur les pousses imparfaitement lignifiées @fr
definition: Frost occurring in early autumn before the year's shoots have hardened off, potentially causing damage to imperfectly lignified shoots.
in scheme: Thesaurus Multirisque FORESTT
preferred label: gelée précoce @fr
was quoted from: Adapté de EPHYTIA-INRAE. Froids-gelées. [En ligne]. [Consulté le 20/02/2026]. <URL : https://ephytia.inrae.fr/fr/C/18542/Forets-Froids-gelees>. @fr
was quoted from: Adapted from EPHYTIA-INRAE. Froids-gelées. [En ligne]. [Consulté le 20/02/2026]. <URL : https://ephytia.inrae.fr/fr/C/18542/Forets-Froids-gelees>.

species-specific sensitivity
has status: Published
type: Concept
broader: forest sensitivity
definition: Mesure dans laquelle une essence particulière est affectée par l'exposition à un aléa. @fr
definition: Extent to which a particular species is affected by exposure to a hazard.
in scheme: Thesaurus Multirisque FORESTT
narrower: host species
narrower: resistant host
narrower: shallow tree rooting depth
narrower: early budburst
narrower: deciduous foliage
narrower: thin bark
preferred label: sensibilité spécifique @fr
was quoted from: Adapté de GIEC (2018) Glossaire. [En ligne]. Genève, GIEC. [Consulté le 20/02/2026]. <URL : https://www.ipcc.ch/site/assets/uploads/sites/2/2019/10/SR15_Glossary_french.pdf>. @fr
was quoted from: Adapted from GIEC (2018) Glossaire. [En ligne]. Genève, GIEC. [Consulté le 20/02/2026]. <URL : https://www.ipcc.ch/site/assets/uploads/sites/2/2019/10/SR15_Glossary_french.pdf>.

spatio-temporal framework of risk measurement
has status: Published
type: Concept
broader: risk level
definition: Definition of the spatial and temporal limits for the analysis of the system of interest subject to risk.
definition: Définition des limites spatiales et temporelles d’analyse du système d'intérêt soumis au risque. @fr
in scheme: Thesaurus Multirisque FORESTT
narrower: spatial scope of risk measurement
narrower: time window of risk measurement
preferred label: cadre spatio-temporel de la mesure du risque @fr
was quoted from: Groupe de travail « Thésaurus du multirisque en forêt » du projet X-RISKS du PEPR FORESTT (ANR-24-PEFO-0005). [En ligne]. <URL : https://www.pepr-forestt.fr/projets/pc-x-risks> @fr

sensitive host
has status: Published
type: Concept
alternative label: espèce sensible @fr
alternative label: susceptible species
broader: host species
definition: Susceptibility of a host to a pathogen.
definition: Fragilité d'un hôte vis-à-vis d'un pathogène. @fr
in scheme: Thesaurus Multirisque FORESTT
narrower: bark susceptible to pine wood nematode
narrower: plant contaminated by pine wood nematode
narrower: plant susceptible to pine wood nematode
narrower: plant identified with respect to pine wood nematode
narrower: asymptomatic tree
narrower: wood susceptible to pine wood nematode
narrower: harvest residue with respect to the nematode
preferred label: hôte sensible @fr
was quoted from: Groupe de travail « Thésaurus du multirisque en forêt » du projet X-RISKS du PEPR FORESTT (ANR-24-PEFO-0005). [En ligne]. <URL : https://www.pepr-forestt.fr/projets/pc-x-risks> @fr

biotic hazard
has status: Published
type: Concept
broader: hazard affecting the forest
definition: The potential occurrence of a trend or phenomenon caused by a biological agent likely to cause damage and loss to forest ecosystems and their services.
definition: Éventualité d’une tendance ou d’un phénomène causé par un agent biologique susceptible d’entraîner des dégâts et des pertes touchant les écosystèmes forestiers et à leurs services. @fr
in scheme: Thesaurus Multirisque FORESTT
narrower: plant bioagressor
preferred label: aléa biotique @fr
was quoted from: Adapté de GIEC (2018) Glossaire. Rapport spécial sur les conséquences d’un réchauffement planétaire de 1,5 °C. [En ligne]. Genève, GIEC. [Consulté le 20/02/2026]. <URL : https://www.ipcc.ch/site/assets/uploads/sites/2/2019/10/SR15_Glossary_french.pdf>. @fr
was quoted from: Adapted from GIEC (2018) Glossaire. Rapport spécial sur les conséquences d’un réchauffement planétaire de 1,5 °C. [En ligne]. Genève, GIEC. [Consulté le 20/02/2026]. <URL : https://www.ipcc.ch/site/assets/uploads/sites/2/2019/10/SR15_Glossary_french.pdf>.

societal and organisational vulnerability
has status: Published
type: Concept
broader: vulnerability of the wood sector
definition: Vulnerability of the forest-wood sector related to societal vulnerabilities or organisational weaknesses within the sector.
definition: Vulnérabilité de la filière forêt-bois liée aux vulnérabilités sociétales ou aux fragilités organisationnelles du secteur. @fr
in scheme: Thesaurus Multirisque FORESTT
narrower: lack of risk culture
narrower: inter-service competition
preferred label: vulnérabilité sociétale et organisationelle @fr
was quoted from: Groupe de travail « Thésaurus du multirisque en forêt » du projet X-RISKS du PEPR FORESTT (ANR-24-PEFO-0005). [En ligne]. <URL : https://www.pepr-forestt.fr/projets/pc-x-risks> @fr

seed-feeding insect
has status: Published
type: Concept
broader: reproductive organ pest insect
definition: Insecte se nourrissant de graines. @fr
definition: Insect feeding on seeds.
in scheme: Thesaurus Multirisque FORESTT
preferred label: insecte séminiphage @fr
was quoted from: Adapté de Bouget et al. (2005) Nomenclature des groupes écologiques d’insectes liés au bois. [En ligne]. Paris, Comptes Rendus Biologies. [Consulté le 20/02/2026]. <URL : https://doi.org/10.1016/j.crvi.2005.08.003>. @fr
was quoted from: Adapted from Bouget et al. (2005) Nomenclature des groupes écologiques d’insectes liés au bois. [En ligne]. Paris, Comptes Rendus Biologies. [Consulté le 20/02/2026]. <URL : https://doi.org/10.1016/j.crvi.2005.08.003>.

rise in insurance premiums for owners
has status: Published
type: Concept
broader: vulnerability of owners
definition: Vulnerability of forest owners related to the rise in insurance premiums for their forest.
definition: Vulnérabilité des propriétaires forestiers liée à la hausse de la prime d'assurance de leur forêt. @fr
in scheme: Thesaurus Multirisque FORESTT
preferred label: augmentation de la prime d'assurance des propriétaires @fr
was quoted from: Groupe de travail « Thésaurus du multirisque en forêt » du projet X-RISKS du PEPR FORESTT (ANR-24-PEFO-0005). [En ligne]. <URL : https://www.pepr-forestt.fr/projets/pc-x-risks> @fr

aggregated risk measure
has status: Published
type: Concept
broader: multi-risk assessment method
definition: Measure integrating the combined level of all risks taken into account in a multi-risk assessment.
definition: Mesure intégrant le niveau conjoint de l'ensemble des risques pris en compte dans une évaluation multirisque. @fr
in scheme: Thesaurus Multirisque FORESTT
preferred label: mesure agrégée du risque @fr
was quoted from: Groupe de travail « Thésaurus du multirisque en forêt » du projet X-RISKS du PEPR FORESTT (ANR-24-PEFO-0005). [En ligne]. <URL : https://www.pepr-forestt.fr/projets/pc-x-risks> @fr

non-compliance with the wood use hierarchy
has status: Published
type: Concept
broader: economic loss for the company
definition: Mauvaise pratique consistant à ne pas utiliser prioritairement le bois pour des applications à valeur ajoutée (bois d'œuvre, industrie) avant de l'utiliser comme biomasse pour l'énergie, et donc de na pas optimiser la ressource et ni promouvoir une économie circulaire. @fr
definition: Poor practice consisting of not giving priority to using wood for value-added applications (timber, industry) before using it as biomass for energy, thereby failing to optimise the resource or promote a circular economy.
in scheme: Thesaurus Multirisque FORESTT
preferred label: non respect de la hiérarchie des usages du bois @fr
was quoted from: Adapté de Alexandre (2014). Le bois, un matériau rare ? Vers une hiérarchie des usages du bois. Revue forestière française, LXVI(3). [En ligne]. HAL : hal-03447548. [Consulté le 03/06/2026]. <URL : https://hal.science/hal-03447548/document> @fr
was quoted from: Adapted from Alexandre (2014). Le bois, un matériau rare ? Vers une hiérarchie des usages du bois. Revue forestière française, LXVI(3). [En ligne]. HAL : hal-03447548. [Consulté le 03/06/2026]. <URL : https://hal.science/hal-03447548/document>

maintenance of wooded land status
has status: Published
type: Concept
broader: silvicultural action
definition: Interdiction du défrichement lorsque la conservation des bois ou des massifs qu'ils complètent, ou le maintien de la destination forestière des sols, est reconnu nécessaire au maintien des terres sur les montagnes ou sur les pentes. @fr
definition: Prohibition of land clearing when the conservation of woods, or the massifs they are part of, or the maintenance of forest land use, is recognised as necessary for holding land on mountains or slopes.
in scheme: Thesaurus Multirisque FORESTT
preferred label: maintien de l'état boisé @fr
was quoted from: Adapté de République Française. Code forestier - Article L311-3. [En ligne]. Légifrance. [Consulté le 02/04/2026]. <URL : https://www.legifrance.gouv.fr/codes/article_lc/LEGIARTI000006610742> @fr
was quoted from: Adapted from République Française. Code forestier - Article L311-3. [En ligne]. Légifrance. [Consulté le 02/04/2026]. <URL : https://www.legifrance.gouv.fr/codes/article_lc/LEGIARTI000006610742>

classical biological control
has status: Published
type: Concept
alternative label: lacher les ennemis @fr
alternative label: lacher les hypovirus @fr
alternative label: release natural enemies
alternative label: release hypovirulent strains
broader: biological control
definition: Introduction délibérée et l'établissement durable d'un agent biologique exotique à des fins de lutte à long terme contre les ravageurs en forêt. @fr
definition: Deliberate introduction and lasting establishment of an exotic biological agent for the long-term control of forest pests.
in scheme: Thesaurus Multirisque FORESTT
preferred label: lutte biologique classique @fr
was quoted from: Adapté de AGROVOC. Lutte biologique classique. [En ligne]. FAO. [Consulté le 25/03/2026]. <URL : https://agrovoc.fao.org/browse/agrovoc/fr/page/c_1381746002639> @fr
was quoted from: Adapted from AGROVOC. Lutte biologique classique. [En ligne]. FAO. [Consulté le 25/03/2026]. <URL : https://agrovoc.fao.org/browse/agrovoc/fr/page/c_1381746002639>

low investment capacity of processing actors
has status: Published
type: Concept
broader: vulnerability of processing actors
definition: Vulnerability of forest processing actors related to their insufficient capacity to invest in new facilities or new equipment.
definition: Vulnérabilité des acteurs de la transformation forestière liée à leur trop faible capacité à investir dans de nouvelles installations ou de nouveaux équipements. @fr
in scheme: Thesaurus Multirisque FORESTT
preferred label: faible capacité d'investissement des acteurs de la transformation @fr
was quoted from: Groupe de travail « Thésaurus du multirisque en forêt » du projet X-RISKS du PEPR FORESTT (ANR-24-PEFO-0005). [En ligne]. <URL : https://www.pepr-forestt.fr/projets/pc-x-risks> @fr

incentive for silviculture in protection forests
has status: Published
type: Concept
broader: regulatory measure
definition: Financial aid (subsidies, tax reductions) for silviculture in protection forests, promoting sustainable management against gravitational hazards.
definition: Aides financières (subventions, réductions d'impôt) pour sylviculture en forêts de protection, favorisant la gestion durable contre les aléas gravitaires. @fr
in scheme: Thesaurus Multirisque FORESTT
preferred label: incitation à la sylviculture en forêt de protection @fr
was quoted from: Adapted from État de Vaud. Forêts protectrices et protection de la forêt. [En ligne]. Canton de Vaud. [Consulté le 25/03/2026]. <URL : https://www.vd.ch/environnement/foret/subventions-pour-les-forets/forets-protectrices>
was quoted from: Adapté de État de Vaud. Forêts protectrices et protection de la forêt. [En ligne]. Canton de Vaud. [Consulté le 25/03/2026]. <URL : https://www.vd.ch/environnement/foret/subventions-pour-les-forets/forets-protectrices> @fr

horizontal fuel continuity
has status: Published
type: Concept
broader: stand structure
definition: Caractérise la distribution horizontale des particules combustibles dans un peuplement forestier. @fr
definition: Characterises the horizontal distribution of fuel particles in a forest stand.
in scheme: Thesaurus Multirisque FORESTT
preferred label: continuité horizontale du combustible @fr
was quoted from: Adapté de Revertegat et al. (2025) Synthèse sur la vulnérabilité des peuplements forestiers au feu. Rapport final du projet AFORCE VULNEFEU (Vulnefeu04). [En ligne]. Réseau AFORCE, 2025. [Consulté le 25/03/2026]. <URL : https://www.reseau-aforce.fr/sites/reseau-aforce/files/2025-07/Rapport-Vulnefeu04-compressed.pdf @fr
was quoted from: Adapted from Revertegat et al. (2025) Synthèse sur la vulnérabilité des peuplements forestiers au feu. Rapport final du projet AFORCE VULNEFEU (Vulnefeu04). [En ligne]. Réseau AFORCE, 2025. [Consulté le 25/03/2026]. <URL : https://www.reseau-aforce.fr/sites/reseau-aforce/files/2025-07/Rapport-Vulnefeu04-compressed.pdf

landscape depreciation
has status: Published
type: Concept
broader: loss of cultural ecosystem service
definition: Perte de valeur esthétique du paysage forestier. @fr
definition: Loss of aesthetic value of the forest landscape.
in scheme: Thesaurus Multirisque FORESTT
preferred label: dépréciation du paysage @fr
was quoted from: Adapté de Millennium Ecosystem Assessment (2005) Ecosystems and Human Well-being. En ligne]. Millennium Ecosystem Assessment. [Consulté le 01/04/2026]. <URL : https://www.millenniumassessment.org/documents/document.765.aspx.pdf> @fr
was quoted from: Adapted from Millennium Ecosystem Assessment (2005) Ecosystems and Human Well-being. En ligne]. Millennium Ecosystem Assessment. [Consulté le 01/04/2026]. <URL : https://www.millenniumassessment.org/documents/document.765.aspx.pdf>

forest planning for risk adaptation and management
has status: Published
type: Concept
broader: prevention
definition: Planification de la gestion forestière intégrant l'adaptation et la réduction des risques. @fr
definition: Forest management planning integrating risk adaptation and reduction.
in scheme: Thesaurus Multirisque FORESTT
narrower: adaptive forest planning
narrower: choice of target species
preferred label: planification forestière pour l'adaptation et la gestion des risques @fr
was quoted from: Adapté de FAO. Forest management planning. [En ligne]. Sustainable Forest Management Toolbox, FAO, 2015. [Consulté le 01/04/2026]. <URL : https://www.fao.org/sustainable-forest-management-toolbox/modules/forest-management-planning/fr> @fr
was quoted from: Adapted from FAO. Forest management planning. [En ligne]. Sustainable Forest Management Toolbox, FAO, 2015. [Consulté le 01/04/2026]. <URL : https://www.fao.org/sustainable-forest-management-toolbox/modules/forest-management-planning/fr>