Reference data for water level gauges relevant to navigation
type: Concept
order: 060219
start date: 2019-07-06
created: 2024-05-21
broader: Inland waterways datasets
definition: data sets as described in Commission Implementing Regulation (EU) 2023/138 of 21 December 2022 laying down a list of specific high-value datasets and the arrangements for their publication and re-use, Annex, Section 6
in scheme: High-value dataset categories
preferred label: A hajózás szempontjából lényeges vízmércék referenciaadatai @hu
preferred label: Referenčné údaje z vodočetných staníc vzťahujúce sa k plavbe @sk
preferred label: Dados de referência dos fluviómetros de interesse para a navegação @pt
preferred label: Referentiegegevens voor waterstandmeters die relevant zijn voor de binnenvaart @nl
preferred label: Dane informacyjne o (wodowskazach) istotnych dla żeglugi @pl
preferred label: Date de referință privind indicatoarele hidrometrice relevante pentru navigație @ro
preferred label: Referensuppgifter för vattennivåmätare som är av betydelse för navigering @sv
preferred label: Sonraí tagartha le haghaidh tomhais uisceleibhéil atá ábhartha maidir le loingseoireacht @ga
preferred label: Справочни данни за нивото на водите, свързани с навигацията @bg
preferred label: Données de référence concernant les niveaux d’eau utiles à la navigation @fr
preferred label: Datos de referencia para los indicadores del nivel del agua pertinentes para la navegación @es
preferred label: Referencedata for vandstandsmålere, som har betydning for sejladsen @da
preferred label: Referenční údaje pro vodočty, které jsou důležité pro plavbu @cs
preferred label: Δεδομένα αναφοράς για τους μετρητές στάθμης των υδάτων στην εσωτερική ναυσιπλοΐα @el
preferred label: Tiedot liikennöinnin kannalta olennaisista vedenkorkeusmittareista @fi
preferred label: Referenzdaten für die schifffahrtsrelevanten Pegel @de
preferred label: Dati di riferimento relativi al livello dell'acqua utili per la navigazione @it
preferred label: Referenčni podatki za merilnike vodostaja, ki so pomembni za plovbo @sl
preferred label: Navigacijai reikalingi baziniai duomenys apie vandens lygio matavimo stotis @lt
preferred label: Atsauces dati attiecībā uz ūdens līmeņa mērinstrumentiem, kas būtiski navigācijā @lv
preferred label: Referentni podaci za mjerače vodostaja koji su važni za navigaciju @hr
preferred label: Navigatsiooni jaoks asjakohaste veetasememõõturite võrdlusandmed @et
preferred label: Data ta’ referenza għal kejl standard tal-livell tal-ilma rilevanti għan-navigazzjoni @mt

Inland waterways datasets
type: Concept
order: 0602
start date: 2019-07-06
created: 2024-05-21
broader: Mobility
definition: data sets as described in Commission Implementing Regulation (EU) 2023/138 of 21 December 2022 laying down a list of specific high-value datasets and the arrangements for their publication and re-use, Annex, Section 6
in scheme: High-value dataset categories
preferred label: Vidaus vandenų kelių duomenų rinkiniai @lt
preferred label: Conjuntos de dados sobre as vias navegáveis interiores @pt
preferred label: Набори от данни за вътрешните водни пътища @bg
preferred label: Settijiet tad-data dwar il-passaġġi fuq l-ilma interni @mt
preferred label: Serie di dati sulle vie navigabili interne @it
preferred label: Voies navigables intérieures @fr
preferred label: Binnenschifffahrtsdatensätze @de
preferred label: Belvízi utakra vonatkozó adatkészletek @hu
preferred label: Σύνολα δεδομένων εσωτερικών πλωτών οδών @el
preferred label: Súbory údajov o vnútrozemskej vodnej preprave @sk
preferred label: Datové soubory týkající se vnitrozemských vodních cest @cs
preferred label: Zbiory danych dotyczące śródlądowych dróg wodnych @pl
preferred label: Conjuntos de datos sobre vías navegables interiores @es
preferred label: Dataset som avser inre vattenvägar @sv
preferred label: Nabori podatkov o celinskih plovnih poteh @sl
preferred label: Iekšējo ūdensceļu datu kopas @lv
preferred label: Datasets over binnenwateren @nl
preferred label: Seturi de date privind căile navigabile interioare @ro
preferred label: Datasæt vedrørende indre vandveje @da
preferred label: Siseveeteede andmestikud @et
preferred label: Skupovi podataka o unutarnjim vodnim putovima @hr
preferred label: Sisävesiväyliä koskevat tietokokonaisuudet @fi
preferred label: Tacair sonraí uiscebhealaí intíre @ga

High-value dataset categories
type: ConceptScheme
start date: 2019-07-06
created: 2023-09-05
modified: 2023-09-07
issued: 2024-10-02
version info: 2.1

Mobility
type: Concept
order: 06
start date: 2019-07-06
created: 2023-09-05
definition: data sets as described in Commission Implementing Regulation (EU) 2023/138 of 21 December 2022 laying down a list of specific high-value datasets and the arrangements for their publication and re-use, Annex, Section 6
in scheme: High-value dataset categories
preferred label: Domeniul Mobilitate @ro
preferred label: Mobilität @de
preferred label: Rörlighet @sv
preferred label: Mobilidade @pt
preferred label: Movilidad @es
preferred label: Soghluaisteacht @ga
preferred label: Mobilitási adatok @hu
preferred label: Mobilnost @hr
preferred label: Mobilité @fr
preferred label: Mobiliteit @nl
preferred label: Liikuvus @et
preferred label: Mobilitet @da
preferred label: Data dwar il-mobbiltà @mt
preferred label: Liikkuvuustiedot @fi
preferred label: Dati relativi alla mobilità @it
preferred label: Mobilitāte @lv
preferred label: Mobilita @cs
preferred label: Dane dotyczące mobilności @pl
preferred label: Мобилност @bg
preferred label: Κινητικότητα @el
preferred label: Judumas @lt
modified: 2024-05-17
top concept of: High-value dataset categories

Employment
type: Concept
order: 0420
start date: 2019-07-06
created: 2024-05-17
broader: Statistics
definition: data sets as described in Commission Implementing Regulation (EU) 2023/138 of 21 December 2022 laying down a list of specific high-value datasets and the arrangements for their publication and re-use, Annex, Section 4
in scheme: High-value dataset categories
preferred label: Zatrudnienie @pl
preferred label: Emploi @fr
preferred label: Emprego @pt
preferred label: Empleo @es
preferred label: Užimtumas @lt
preferred label: Ocuparea forței de muncă @ro
preferred label: Nodarbinātība @lv
preferred label: Sysselsättning @sv
preferred label: Foglalkoztatás @hu
preferred label: Beskæftigelse @da
preferred label: Απασχόληση @el
preferred label: Occupazione @it
preferred label: Erwerbstätigkeit @de
preferred label: Zamestnanosť @sk
preferred label: Заетост @bg
preferred label: Työllisyys @fi
preferred label: Tööhõive @et
preferred label: L-impjiegi @mt
preferred label: Werkgelegenheid @nl
preferred label: Zaposlenost @hr
preferred label: Fostaíocht @ga
preferred label: Zaměstnanost @cs

Statistics
type: Concept
order: 04
start date: 2019-07-06
created: 2023-09-05
definition: data sets as described in Commission Implementing Regulation (EU) 2023/138 of 21 December 2022 laying down a list of specific high-value datasets and the arrangements for their publication and re-use, Annex, Section 4
in scheme: High-value dataset categories
preferred label: Domeniul statistic @ro
preferred label: Statistički podatci @hr
preferred label: Dane statystyczne @pl
preferred label: Dati statistici @it
preferred label: Στατιστικές @el
preferred label: Staidreamh @ga
preferred label: Data statistika @mt
preferred label: Štatistika @sk
preferred label: Statisztikák @hu
preferred label: Statistiques @fr
preferred label: Statistika @et
preferred label: Estatísticas @pt
preferred label: Estadística @es
preferred label: Statistiek @nl
preferred label: Статистика @bg
preferred label: Statistični podatki @sl
preferred label: Statistik @da
preferred label: Tilastotiedot @fi
modified: 2024-05-17
top concept of: High-value dataset categories

Shoreline construction
type: Concept
order: 060221
start date: 2019-07-06
created: 2024-05-21
broader: Inland waterways datasets
definition: data sets as described in Commission Implementing Regulation (EU) 2023/138 of 21 December 2022 laying down a list of specific high-value datasets and the arrangements for their publication and re-use, Annex, Section 6
in scheme: High-value dataset categories
preferred label: Pobrežná konštrukcia @sk
preferred label: Budowa linii brzegowej @pl
preferred label: Παρόχθιες κατασκευές @el
preferred label: Partvonali építmények @hu
preferred label: Sestavení pobřežní čáry @cs
preferred label: Costruzione litoranea @it
preferred label: Konstruktioner langs bredden @da
preferred label: Obalna konstrukcija @sl
preferred label: Obalne konstrukcije @hr
preferred label: Krasta konstrukcijas @lv
preferred label: Kustlijnconstructie @nl
preferred label: Construcción litoral @es
preferred label: Uferbefestigung @de
preferred label: Tógáil líne cladaigh @ga
preferred label: Kaldarajatis @et
preferred label: Bini mal-linja tal-kosta @mt
preferred label: Construcție pe țărm @ro
preferred label: Construção nas margens @pt
preferred label: Крайбрежно строителство @bg
preferred label: Construction de rivage @fr
preferred label: Rantarakenne @fi
preferred label: Strandlinjekonstruktion @sv
preferred label: Priekrantės statiniai @lt

Volume of sales by activity
type: Concept
order: 0403
start date: 2019-07-06
created: 2024-05-17
broader: Statistics
definition: data sets as described in Commission Implementing Regulation (EU) 2023/138 of 21 December 2022 laying down a list of specific high-value datasets and the arrangements for their publication and re-use, Annex, Section 4
in scheme: High-value dataset categories
preferred label: Όγκος πωλήσεων ανά δραστηριότητα @el
preferred label: Myynnin volyymi toimialoittain @fi
preferred label: Pardavimo apimtis pagal veiklos rūšis @lt
preferred label: Müügimaht tegevusalade kaupa @et
preferred label: Volume delle vendite per attività @it
preferred label: Volume des ventes par activité @fr
preferred label: An méid díolachán de réir gníomhaíochta @ga
preferred label: Volumul vânzărilor pe activități @ro
preferred label: Обем на продажбите по дейности @bg
preferred label: Omvang van de verkoop per activiteit @nl
preferred label: Salgsmængde opdelt efter aktivitet @da
preferred label: Volum ta’ bejgħ skont l-attività @mt
preferred label: Objem predaja podľa činnosti @sk
preferred label: Obujam prodaje prema djelatnosti @hr
preferred label: Försäljningsvolym per verksamhet @sv
preferred label: Pārdošanas apjoms pēc nozarēm @lv
preferred label: Verkaufsmengen nach Tätigkeit @de
preferred label: Objem prodeje podle činnosti @cs
preferred label: Volumen de ventas por actividad @es
preferred label: Obseg prodaje po dejavnostih @sl
preferred label: Értékesítési volumen gazdasági tevékenység szerint @hu
preferred label: Volume de vendas, por atividade @pt
preferred label: Wolumen sprzedaży w podziale według działalności @pl

Orthoimagery
type: Concept
order: 0206
start date: 2019-07-06
created: 2024-05-15
broader: Earth observation and environment
definition: data sets as described in Commission Implementing Regulation (EU) 2023/138 of 21 December 2022 laying down a list of specific high-value datasets and the arrangements for their publication and re-use, Annex, Section 2
in scheme: High-value dataset categories
preferred label: Ortofotosnímky @cs
preferred label: Ortoimagens @pt
preferred label: Ortofoto @da
preferred label: Ortoimagini @ro
preferred label: Orthofotografie @de
preferred label: Ortoilmakuvat @fi
preferred label: Orthobeeldvorming @nl
preferred label: Ortai-íomhánna @ga
preferred label: Ортоизображение @bg
preferred label: Ortoimágenes @es
preferred label: Oortografické zobrazovanie @sk
preferred label: Ortho-imagerie @fr
preferred label: Ortoimmaġini @mt
preferred label: Ortofotók @hu
preferred label: Sporządzanie ortoobrazów @pl
preferred label: Orto immagini @it
preferred label: Ortokujutised @et
preferred label: Ortofotografinis vaizdavimas @lt
preferred label: Ortofotografija @hr
preferred label: Ortofotogrāfija @lv
preferred label: Ορθοφωτογραφία @el

Earth observation and environment
type: Concept
order: 02
start date: 2019-07-06
created: 2023-09-05
definition: data sets as described in Commission Implementing Regulation (EU) 2023/138 of 21 December 2022 laying down a list of specific high-value datasets and the arrangements for their publication and re-use, Annex, Section 2
in scheme: High-value dataset categories
preferred label: Γεωσκόπηση και περιβάλλον @el
preferred label: Erdbeobachtung und Umwelt @de
preferred label: Promatranje Zemlje i okoliš @hr
preferred label: Opazovanje zemlje in okolje @sl
preferred label: Observación de la Tierra y medio ambiente @es
preferred label: Jordobservation och miljö @sv
preferred label: Domeniul Observarea Pământului și mediu @ro
preferred label: Observation de la terre et environnement @fr
preferred label: Pozorovanie Zeme a životné prostredie @sk
preferred label: Maan havainnointi ja ympäristö @fi
preferred label: Aardobservatie en milieu @nl
preferred label: Země a životní prostředí @cs
preferred label: Dane dotyczące obserwacji Ziemi i środowiska @pl
preferred label: Faire na cruinne agus an comhshaol @ga
preferred label: Наблюдение на Земята и околната среда @bg
preferred label: Observação da Terra e do ambiente @pt
preferred label: Zemes novērošana un vide @lv
preferred label: Maa seire ja keskkond @et
preferred label: Žemės stebėjimas ir aplinka @lt
preferred label: Dati relativi all'osservazione della terra e all'ambiente @it
preferred label: Data dwar l-osservazzjoni tad-dinja u l-ambjent @mt
preferred label: Jordobservation og miljø @da
preferred label: Földmegfigyelési és környezeti adatok @hu
modified: 2024-05-15
top concept of: High-value dataset categories

Energy resources
type: Concept
order: 0209
start date: 2019-07-06
created: 2024-05-15
broader: Earth observation and environment
definition: data sets as described in Commission Implementing Regulation (EU) 2023/138 of 21 December 2022 laying down a list of specific high-value datasets and the arrangements for their publication and re-use, Annex, Section 2
in scheme: High-value dataset categories
preferred label: Acmhainní Fuinnimh @ga
preferred label: Resurse energetice @ro
preferred label: Izvori energije @hr
preferred label: Energiaressursid @et
preferred label: Energiavarat @fi
preferred label: Energiequellen @de
preferred label: Energiressourcer @da
preferred label: Energiresurser @sv
preferred label: Energiebronnen @nl
preferred label: Enerģijas resursi @lv
preferred label: Energetski viri @sl
preferred label: Ενεργειακοί πόροι @el
preferred label: Енергийни източници @bg
preferred label: Sources d’énergie @fr
preferred label: Energetické zdroje @cs
preferred label: Riżorsi ta’ Enerġija @mt
preferred label: Energiaforrások @hu
preferred label: Zasoby energetyczne @pl
preferred label: Energijos ištekliai @lt
preferred label: Risorse energetiche @it
preferred label: Recursos energéticos @es

Rates of waterway infrastructure charges
type: Concept
order: 060203
start date: 2019-07-06
created: 2024-05-21
broader: Inland waterways datasets
definition: data sets as described in Commission Implementing Regulation (EU) 2023/138 of 21 December 2022 laying down a list of specific high-value datasets and the arrangements for their publication and re-use, Annex, Section 6
in scheme: High-value dataset categories
preferred label: Odstotki stroškov uporabe infrastrukture na plovnih poteh @sl
preferred label: Rátaí muirear bonneagair uiscebhealaigh @ga
preferred label: Výše poplatků za užívání infrastruktury vodních cest @cs
preferred label: Rati ta’ tariffi ta’ infrastruttura f’passaġġi fuq l-ilma @mt
preferred label: Wielkości opłat za korzystanie z infrastruktury dróg wodnych @pl
preferred label: Avgifter på vattenvägsinfrastrukturen @sv
preferred label: Размер на таксите за инфраструктурата на водните пътища @bg
preferred label: Iznosi naknada za korištenje infrastrukture vodnih putova @hr
preferred label: A vízi infrastruktúra igénybevételéért fizetendő díjak @hu
preferred label: Satser for infrastrukturafgifter på vandvejen @da
preferred label: Ūdensceļu infrastruktūru maksu tarifi @lv
preferred label: Väylämaksujen määrät @fi
preferred label: Tarief/heffingen voor gebruik waterweginfrastructuur @nl
preferred label: Taxas de utilização das infraestruturas da via navegável @pt
preferred label: Ύψος τελών των υποδομών πλωτών οδών @el
preferred label: Vandens kelių infrastruktūros mokesčių dydžiai @lt
preferred label: Diritti d'infrastruttura delle vie navigabili @it
preferred label: Sadzby poplatkov za užívanie infraštruktúry vodných ciest @sk
preferred label: Veeteede infrastruktuuritasude määrad @et
preferred label: Frais d’infrastructure des voies navigables @fr
preferred label: Gastos de infraestructura de las vías navegables @es
preferred label: Ratele taxelor de utilizare a infrastructurii căilor navigabile @ro
preferred label: Höhe der Abgaben für die Wasserstraßen-Infrastruktur @de

Population, Fertility, Mortality
type: Concept
order: 0413
start date: 2019-07-06
created: 2024-05-17
broader: Statistics
definition: data sets as described in Commission Implementing Regulation (EU) 2023/138 of 21 December 2022 laying down a list of specific high-value datasets and the arrangements for their publication and re-use, Annex, Section 4
in scheme: High-value dataset categories
preferred label: Rahvastik, sündimus, suremus @et
preferred label: Bevolking, vruchtbaarheid, sterfte @nl
preferred label: Befolkning, fertilitet, dødelighed @da
preferred label: Prebivalstvo, rodnost, smrtnost @sl
preferred label: Népesség, Termékenység, Mortalitás @hu
preferred label: Πληθυσμός, γονιμότητα, θνησιμότητα @el
preferred label: Población, fertilidad, mortalidad @es
preferred label: Ludność, współczynnik płodności, współczynnik śmiertelności @pl
preferred label: Populația, fertilitatea, mortalitatea @ro
preferred label: Populace, plodnost, úmrtnost @cs
preferred label: Populácia, plodnosť, úmrtnosť @sk
preferred label: Iedzīvotāju skaits, dzimstība, mirstība @lv
preferred label: Befolkning, fertilitet, mortalitet @sv
preferred label: Bevölkerung, Fertilität, Mortalität @de
preferred label: Popolazione, fertilità, mortalità @it
preferred label: Stanovništvo, fertilitet, mortalitet @hr
preferred label: Daonra, Torthúlacht, Mortlaíocht @ga
preferred label: População, fecundidade, mortalidade @pt
preferred label: Väestö, syntyvyys, kuolleisuus @fi
preferred label: Il-Popolazzjoni, il-Fertilità, l-Mortalità @mt
preferred label: Gyventojai, gimstamumas, mirtingumas @lt
preferred label: Population, fécondité et mortalité @fr
preferred label: Население, плодовитост, смъртност @bg

EU International trade in goods statistics – exports and imports breakdowns simultaneously by partner, product and flow
type: Concept
order: 0404
start date: 2019-07-06
created: 2024-05-17
broader: Statistics
definition: data sets as described in Commission Implementing Regulation (EU) 2023/138 of 21 December 2022 laying down a list of specific high-value datasets and the arrangements for their publication and re-use, Annex, Section 4
in scheme: High-value dataset categories
preferred label: Statisticile UE privind comerțul internațional cu bunuri – exporturi și importuri defalcate simultan per parteneri, produse și fluxuri @ro
preferred label: ES starptautiskās preču tirdzniecības statistika – eksporta un importa sadalījums paralēli pēc partnera, produkta un plūsmas @lv
preferred label: ES tarptautinės prekybos prekėmis statistika. Vienalaikis eksporto ir importo suskirstymas pagal partnerius, produktus ir srautus @lt
preferred label: ELi rahvusvahelise kaubavahetuse statistika – eksport ja import jaotus samaaegselt partnerite, toodete ja kaubavoogude kaupa @et
preferred label: Statistik over EU's internationale handel med varer — eksport og import opdelt efter partner, produkt og handelsstrøm @da
preferred label: Statistiques sur le commerce international de biens dans l’UE: exportations et importations ventilées à la fois par partenaire, par produit et par flux @fr
preferred label: Статистика за международната търговия на ЕС със стоки — износ и внос, разбивки едновременно по партньори, продукти и потоци @bg
preferred label: Statistiche sugli scambi internazionali di beni dell'UE — disaggregazioni di esportazioni e importazioni simultaneamente per partner, prodotto e flusso @it
preferred label: Statistik över internationell varuhandel i EU – export och import uppdelat efter partner, produkt och produktflöde @sv
preferred label: Staidreamh maidir le trádáil idirnáisiúnta de chuid an Aontais in earraí – onnmhairí agus allmhairí miondealuithe arna ndéanamh go comhuaineach de réir an chomhpháirtí, an táirge agus na sreibhe @ga
preferred label: EU:n kansainvälistä tavarakauppaa koskevat tilastot – vienti ja tuonti jaoteltuna samanaikaisesti kauppakumppanin, tuotteen ja kauppavirran mukaan @fi
preferred label: Στατιστικές της ΕΕ σχετικά με το διεθνές εμπόριο αγαθών — εξαγωγές και εισαγωγές ταυτόχρονες κατανομές ανά εταίρο, προϊόν και ροή @el
preferred label: Statistični podatki o mednarodni blagovni menjavi EU – hkratna razčlenitev izvoza in uvoza po partnerskih državah, proizvodih in toku @sl
preferred label: Statistika EU-a o međunarodnoj trgovini robom – paralelne raščlambe izvoza i uvoza prema partneru, proizvodu i toku @hr
preferred label: Statistieken over de internationale handel in goederen van de EU — in- en uitvoer gelijktijdige uitsplitsingen naar partner, product en stroom @nl
preferred label: Statistika mezinárodního obchodu EU se zbožím – vývoz a dovoz, členění zároveň podle partnerů, výrobků a toků @cs
preferred label: Estadísticas de la UE sobre comercio internacional de bienes: exportaciones e importaciones desgloses simultáneos por socio, producto y flujo @es
preferred label: Európska štatistika medzinárodného obchodu s tovarom – vývoz a dovoz členenia podľa partnera, výrobku a toku zároveň @sk
preferred label: Statystyki dotyczące międzynarodowego handlu towarami UE – wywóz i przywóz podział jednocześnie według partnera, produktu i przepływu @pl
preferred label: Estatísticas sobre o comércio internacional de bens da UE – desagregações das exportações e importações simultaneamente por parceiro, produto e fluxo @pt
preferred label: Az EU nemzetközi árukereskedelmi statisztikái – export és import partnerek, termékek és forgalom szerinti egyidejű bontások @hu
preferred label: L-istatistiċi tal-kummerċ Internazzjonali tal-UE fil-merkanzija – l-esportazzjonijiet u l-importazzjonijiet diżaggregazzjonijiet simultanjament skont is-sieħeb, il-prodott u l-fluss @mt
preferred label: Statistik des internationalen Warenverkehrs der EU – Ausfuhren und Einfuhren Aufschlüsselung gleichzeitig nach Partnern, Produkten und Warenströmen @de

Official aids-to-navigation (e.g. buoys, beacons, lights, notice marks)
type: Concept
order: 060225
start date: 2019-07-06
created: 2024-05-21
broader: Inland waterways datasets
definition: data sets as described in Commission Implementing Regulation (EU) 2023/138 of 21 December 2022 laying down a list of specific high-value datasets and the arrangements for their publication and re-use, Annex, Section 6
in scheme: High-value dataset categories
preferred label: Officiel farvandsafmærkning (bøjer, båker, fyr, skilte mv.) @da
preferred label: Offizielle Schifffahrtszeichen (z. B. Tonnen, Baken, Leuchtzeichen, Tafelzeichen) @de
preferred label: Officiella sjömärken (t.ex. bojar, prickar, fyrar, tavlor) @sv
preferred label: Ausili ufficiali alla navigazione (ad esempio boe, fari, segnali luminosi e pannelli di segnalazione) @it
preferred label: Dispozitive oficiale de asistență în navigație (de ex., geamanduri, balize, semnale luminoase, panouri de semnalizare) @ro
preferred label: Oficialūs navigacijos įrenginiai (pvz., plūdurai, bakenai, švyturiai, įspėjamieji ženklai) @lt
preferred label: Официални помощни средства за корабоплаването (напр. буйове, маяци, сигнални светлини, указателни знаци) @bg
preferred label: Uradni navigacijski pripomočki (npr. boje, svetilniki, luči, plovbni znaki) @sl
preferred label: Officiële navigatiehulpmiddelen (zoals tonnen, bakens, lichtseinen en verkeerstekens) @nl
preferred label: Dispositifs officiels d’assistance à la navigation (par ex. bouées, balises, signaux lumineux et panneaux de signalisation) @fr
preferred label: Oficjalne pomoce nawigacyjne (np. boje, pławy, światła, znaki z komunikatami) @pl
preferred label: Oficiálne podporné pomôcky pri plavbe (napr. bójky, majáky, svetlá, výstražné značky) @sk
preferred label: Ajudas à navegação oficiais (por exemplo, boias, balizas, luzes, sinalização) @pt
preferred label: Għajnuniet għan-navigazzjoni uffiċjali (eż. bagi, sinjalaturi, dwal, avviżi) @mt
preferred label: Áiseanna loingseoireachta oifigiúla (e.g. baoithe, rabhcháin, soilse, marcanna fógra) @ga
preferred label: Službena navigacijska sredstva (npr. plutače, svjetionici, svjetla, oznake) @hr
preferred label: Oficiální podpůrné prostředky pro plavbu (např. bóje, pobřežní znaky, majáky, výstražné značky) @cs
preferred label: Medios auxiliares oficiales (por ejemplo, boyas, balizas, luces, carteles) @es
preferred label: Viralliset navigoinnin turvalaitteet (esim. poijut, meriviitat, valot, ilmoitusmerkit) @fi
preferred label: Hivatalos navigációs segédletek (pl. bóják, világítótornyok, fényjelzések, figyelmeztető jelölések) @hu
preferred label: Oficiālie navigācijas līdzekļi (piemēram, bojas, bākas, ugunis, zīmes) @lv
preferred label: Επίσημα βοηθήματα ναυσιπλοΐας (π.χ. σημαντήρες, υφαλοδείκτες, φανοί, σηματοδοτήσεις) @el
preferred label: Ametlikud navigatsiooniseadmed (nt poid, paagid, tuled, ohutusmärgid) @et

Climate data: validated observations
type: Concept
order: 0302
start date: 2019-07-06
created: 2024-05-17
broader: Meteorological
definition: data sets as described in Commission Implementing Regulation (EU) 2023/138 of 21 December 2022 laying down a list of specific high-value datasets and the arrangements for their publication and re-use, Annex, Section 3
in scheme: High-value dataset categories
preferred label: Klimadata: validerede observationer @da
preferred label: Sonraí aeráide: breathnóireachtaí bailíochtaithe @ga
preferred label: Datos climáticos: observaciones validadas @es
preferred label: Dati climatici: osservazioni convalidate @it
preferred label: Data dwar il-klima: osservazzjonijiet validati @mt
preferred label: Dane klimatyczne: potwierdzone obserwacje @pl
preferred label: Klimaatgegevens: gevalideerde observaties @nl
preferred label: Dati par klimatu: validēti novērojumi @lv
preferred label: Éghajlati adatok: validált megfigyelések @hu
preferred label: Климатични данни: валидирани наблюдения @bg
preferred label: Données climatiques: observations validées @fr
preferred label: Klimadaten: validierte Beobachtungen @de
preferred label: Podnebni podatki: potrjena opazovanja @sl
preferred label: Kliimaandmed: kinnitatud vaatlused @et
preferred label: Klimatološki podaci: validirani podaci motrenja @hr
preferred label: Klimatické údaje: ověřená pozorování @cs
preferred label: Ilmastodata: validoidut havainnot @fi
preferred label: Date privind clima: observații validate @ro
preferred label: Klimatické údaje: validované pozorovania @sk
preferred label: Klimatdata: validerade observationer @sv
preferred label: Dados climáticos: observações validadas @pt
preferred label: Klimato duomenys: patvirtinti stebėjimo duomenys @lt
preferred label: Κλιματικά δεδομένα: επικυρωμένες παρατηρήσεις @el

Meteorological
type: Concept
order: 03
start date: 2019-07-06
created: 2023-09-05
definition: data sets as described in Commission Implementing Regulation (EU) 2023/138 of 21 December 2022 laying down a list of specific high-value datasets and the arrangements for their publication and re-use, Annex, Section 3
in scheme: High-value dataset categories
preferred label: Meteorologische data @nl
preferred label: Meteorologiska data @sv
preferred label: Meteorológicas @pt
preferred label: Meteorológia @sk
preferred label: Dane meteorologiczne @pl
preferred label: Meteorologiniai duomenys @lt
preferred label: Meteorologiske data @da
preferred label: Метеорологични данни @bg
preferred label: Dati meteorologici @it
preferred label: Météorologiques @fr
preferred label: Meitéareolaíoch @ga
preferred label: Säätiedot @fi
preferred label: Meteoroloģijas datu kopas @lv
preferred label: Data meteoroloġika @mt
preferred label: Meteorologie @cs
preferred label: Μετεωρολογικές πληροφορίες @el
preferred label: Domeniul meteorologic @ro
preferred label: Meteorológiai adatok @hu
preferred label: Meteorološki podatki @sl
preferred label: Meteorološki podatci @hr
preferred label: Meteoroloogiateave @et
preferred label: Meteorología @es
modified: 2024-05-17
top concept of: High-value dataset categories

Industrial producer price index breakdowns by activity
type: Concept
order: 0402
start date: 2019-07-06
created: 2024-05-17
broader: Statistics
definition: data sets as described in Commission Implementing Regulation (EU) 2023/138 of 21 December 2022 laying down a list of specific high-value datasets and the arrangements for their publication and re-use, Annex, Section 4
in scheme: High-value dataset categories
preferred label: Členenie cenových indexov priemyselných výrobcov podľa činnosti @sk
preferred label: Producentprisindex för industriprodukter uppdelat per verksamhet @sv
preferred label: Pramonės gamintojų kainų indeksų suskirstymas pagal veiklos rūšis @lt
preferred label: Rūpniecības preču ražotāju cenu indeksa sadalījums pēc nozarēm @lv
preferred label: Industrieller Erzeugerpreisindex – Aufschlüsselung nach Tätigkeit @de
preferred label: Miondealuithe innéacs praghsanna an táirgeora thionsclaíoch de réir gníomhaíochta @ga
preferred label: Defalcările indicelui prețurilor la producătorii interni pe activități @ro
preferred label: Κατανομές του δείκτη τιμών παραγωγού στη βιομηχανία ανά δραστηριότητα @el
preferred label: Raščlamba indeksa cijena industrijskih proizvođača prema djelatnosti @hr
preferred label: Ipari termelői árindex, gazdasági tevékenység szerinti bontások @hu
preferred label: Indexcijfer van de industriële producentenprijzen, uitgesplitst naar activiteit @nl
preferred label: Razčlenitev indeksa cen industrijskih proizvajalcev po dejavnostih @sl
preferred label: Разпределение на цените на индустриален производител по дейности @bg
preferred label: Tööstustootja hinnaindeksi jaotus tegevusalade kaupa @et
preferred label: Členění indexu cen průmyslových výrobců podle činnosti @cs
preferred label: Disaggregazioni dell'indice dei prezzi alla produzione di prodotti industriali per attività @it
preferred label: Desgloses del índice de precios industriales por actividad @es
preferred label: Teollisuuden tuottajahintaindeksin jaottelu toimialoittain @fi
preferred label: Desagregações do índice de preços da produção industrial, por atividade @pt
preferred label: Wskaźnik cen producenta przemysłowego w podziale według działalności @pl
preferred label: Diżaggregazzjonijiet tal-indiċi tal-prezzijiet tal-produtturi industrijali skont l-attività @mt
preferred label: Indeks for industriproducentpriser opdelt efter aktivitet @da
preferred label: Ventilations de l’indice des prix à la production industrielle par activité @fr

Geographical names
type: Concept
order: 0102
start date: 2019-07-06
created: 2024-05-14
broader: Geospatial
definition: data sets as described in Commission Implementing Regulation (EU) 2023/138 of 21 December 2022 laying down a list of specific high-value datasets and the arrangements for their publication and re-use, Annex, Section 1
in scheme: High-value dataset categories
preferred label: Geografiniai pavadinimai @lt
preferred label: Geografische Bezeichnungen @de
preferred label: Τοπωνύμια @el
preferred label: Dénominations géographiques @fr
preferred label: Toponīmi @lv
preferred label: Geografische namen @nl
preferred label: Földrajzi nevek @hu
preferred label: Nombres geográficos @es
preferred label: Geograafilised nimed @et
preferred label: Nazwy geograficzne @pl
preferred label: Stednavne @da
preferred label: Geografska imena @hr
preferred label: Nomi geografici @it
preferred label: Ainmneacha geografacha @ga
preferred label: Географски наименования @bg
preferred label: Toponímia @pt
preferred label: Ismijiet ġeografiċi @mt
preferred label: Geografiska namn @sv
preferred label: Zemepisné názvy @sk
preferred label: Paikannimet @fi
preferred label: Denumiri geografice @ro
preferred label: Zeměpisné názvy @cs

Geospatial
type: Concept
order: 01
start date: 2019-07-06
created: 2023-09-05
definition: data sets as described in Commission Implementing Regulation (EU) 2023/138 of 21 December 2022 laying down a list of specific high-value datasets and the arrangements for their publication and re-use, Annex, Section 1
in scheme: High-value dataset categories
preferred label: Ģeotelpisko datu kopas @lv
preferred label: Geoerdviniai duomenys @lt
preferred label: Georuumilised andmed @et
preferred label: Geoprostorni podatci @hr
preferred label: Data ġeospazjali @mt
preferred label: Georaum @de
preferred label: Geopriestorové údaje @sk
preferred label: Geoespaciais @pt
preferred label: Geospatiala data @sv
preferred label: Geoprostorski podatki @sl
preferred label: Geospatiale data @da
preferred label: Dane geoprzestrzenne @pl
preferred label: Geoespacial @es
preferred label: Paikkatiedot @fi
preferred label: Domeniul geospațial @ro
preferred label: Géospatiales @fr
preferred label: Geospásúil @ga
preferred label: Geoprostorové údaje @cs
preferred label: Γεωχωρικές πληροφορίες @el
preferred label: Геопространствени данни @bg
preferred label: Dati geospaziali @it
preferred label: Térinformatikai adatok @hu
modified: 2024-05-14
top concept of: High-value dataset categories

Climate
type: Concept
order: 0221
start date: 2019-07-06
created: 2024-05-17
broader: Earth observation and environment
definition: data sets as described in Commission Implementing Regulation (EU) 2023/138 of 21 December 2022 laying down a list of specific high-value datasets and the arrangements for their publication and re-use, Annex, Section 2
in scheme: High-value dataset categories
preferred label: Klimaat @nl
preferred label: Kliima @et
preferred label: Clima @es
preferred label: Klimatas @lt
preferred label: Podnebje @sl
preferred label: Klimats @lv
preferred label: Climat @fr
preferred label: Il-klima @mt
preferred label: Ilmasto @fi
preferred label: Klima @cs
preferred label: Climă @ro
preferred label: Podnebie @sk
preferred label: An aeráid @ga
preferred label: Климат @bg
preferred label: Κλίμα @el
preferred label: Klimat @pl
preferred label: Éghajlat @hu

Unemployment
type: Concept
order: 0421
start date: 2019-07-06
created: 2024-05-17
broader: Statistics
definition: data sets as described in Commission Implementing Regulation (EU) 2023/138 of 21 December 2022 laying down a list of specific high-value datasets and the arrangements for their publication and re-use, Annex, Section 4
in scheme: High-value dataset categories
preferred label: Bezrobocie @pl
preferred label: Disoccupazione @it
preferred label: Ανεργία @el
preferred label: Arbejdsløshed @da
preferred label: Nezaposlenost @hr
preferred label: Desempleo @es
preferred label: Dífhostaíocht @ga
preferred label: Безработица @bg
preferred label: Erwerbslosigkeit @de
preferred label: Nezamestnanosť @sk
preferred label: Șomajul @ro
preferred label: Nedarbas @lt
preferred label: Desemprego @pt
preferred label: Werkloosheid @nl
preferred label: Chômage @fr
preferred label: Il-qgħad @mt
preferred label: Bezdarbs @lv
preferred label: Brezposelnost @sl
preferred label: Työttömyys @fi
preferred label: Arbetslöshet @sv
preferred label: Munkanélküliség @hu
preferred label: Töötus @et
preferred label: Nezaměstnanost @cs

Location of ports and transhipment sites
type: Concept
order: 060218
start date: 2019-07-06
created: 2024-05-21
broader: Inland waterways datasets
definition: data sets as described in Commission Implementing Regulation (EU) 2023/138 of 21 December 2022 laying down a list of specific high-value datasets and the arrangements for their publication and re-use, Annex, Section 6
in scheme: High-value dataset categories
preferred label: A kikötők és átrakásra alkalmas területek helymeghatározása @hu
preferred label: Localização dos portos e dos terminais de transbordo @pt
preferred label: Localización de puertos y puntos de transbordo @es
preferred label: Χωροθέτηση λιμένων και σημείων μεταφόρτωσης @el
preferred label: Ostu un pārkraušanas vietu atrašanās vieta @lv
preferred label: Lokalizacja portów i miejsc przeładunkowych @pl
preferred label: Lokalizácia prístavov a prekládkových staníc @sk
preferred label: Разположение на пристанищата и местата за претоварване @bg
preferred label: Umístění přístavů a překladišť @cs
preferred label: Localisation des ports et des sites de transbordement @fr
preferred label: Plaats van havens en overslaginstallaties @nl
preferred label: Amplasarea porturilor și a locurilor de transbordare @ro
preferred label: Suíomh calafort agus láithreán trasloingsithe @ga
preferred label: Satamien ja uudelleenlastauskeskusten sijainti @fi
preferred label: Sadamate ja ümberlaadimispunktide asukohad @et
preferred label: Lage von Häfen und Umschlagstellen @de
preferred label: Lokacija pristanišč in dokov za pretovarjanje @sl
preferred label: Pożizzjoni ta’ portijiet u ta’ siti ta’ trażbord @mt
preferred label: Položaj luka i dokova za pretovar @hr
preferred label: Hamnars och omlastningsanläggningars lokalisering @sv
preferred label: Havnes og omladningssteders beliggenhed @da
preferred label: Uostų ir krovinių perkrovimo centrų vietos @lt
preferred label: Localizzazione di porti e impianti di trasbordo @it

Radar data
type: Concept
order: 0304
start date: 2019-07-06
created: 2024-05-17
broader: Meteorological
definition: data sets as described in Commission Implementing Regulation (EU) 2023/138 of 21 December 2022 laying down a list of specific high-value datasets and the arrangements for their publication and re-use, Annex, Section 3
in scheme: High-value dataset categories
preferred label: Radarové údaje @sk
preferred label: Tutkadata @fi
preferred label: Dane radarowe @pl
preferred label: Radariandmed @et
preferred label: Radara dati @lv
preferred label: Datos de radares @es
preferred label: Radardaten @de
preferred label: Radardata @da
preferred label: Радарни данни @bg
preferred label: Radarski podatki @sl
preferred label: Date radar @ro
preferred label: Data mir-radars @mt
preferred label: Radarski podaci @hr
preferred label: Données radar @fr
preferred label: Dati radar @it
preferred label: Radaradatok @hu
preferred label: Radarų duomenys @lt
preferred label: Δεδομένα ραντάρ @el
preferred label: Dados de radar @pt
preferred label: Radargegevens @nl
preferred label: Sonraí radair @ga

Waterway axis with kilometres indication
type: Concept
order: 060216
start date: 2019-07-06
created: 2024-05-21
broader: Inland waterways datasets
definition: data sets as described in Commission Implementing Regulation (EU) 2023/138 of 21 December 2022 laying down a list of specific high-value datasets and the arrangements for their publication and re-use, Annex, Section 6
in scheme: High-value dataset categories
preferred label: Eixo fluvial, com indicações quilométricas @pt
preferred label: Wasserstraßenachse mit Kilometerangabe @de
preferred label: Väylän linjaus kilometrimerkintöineen @fi
preferred label: Os vodnej cesty v kilometroch @sk
preferred label: Vandvejsakse med angivelse af kilometer @da
preferred label: Υδάτινος άξονας και το μήκος του σε χιλιόμετρα @el
preferred label: Os plovne poti s prikazom kilometrov @sl
preferred label: Os vodnog puta s prikazom kilometara @hr
preferred label: Assi idroviari e loro lunghezza in chilometri @it
preferred label: Waterwegas met kilometeraanduiding @nl
preferred label: Assi tal-passaġġ fuq l-ilma b’indikazzjoni kilometrika @mt
preferred label: Ejes de vías navegables con indicación de los kilómetros @es
preferred label: Vandens kelio kryptis nurodant kilometrus @lt
preferred label: Laevatee telg kilomeetrites @et
preferred label: Osa vodní cesty s uvedením kilometráže @cs
preferred label: A vízi út tengelye kilométer-jelöléssel @hu
preferred label: Axe fluvial avec indication kilométrique @fr
preferred label: Vattenvägsaxlar med kilometerindikering @sv
preferred label: Ос на водния път с показване на километрите @bg
preferred label: Axa căii navigabile, cu indicarea kilometrilor @ro
preferred label: Drogi wodne z oznaczeniem ich długości w kilometrach @pl
preferred label: Ais uiscebhealaigh lena ngabhann tásc ciliméadar @ga
preferred label: Ūdensceļa asis ar kilometru atzīmēm @lv

Bio-geographical regions
type: Concept
order: 0208
start date: 2019-07-06
created: 2024-05-15
broader: Earth observation and environment
definition: data sets as described in Commission Implementing Regulation (EU) 2023/138 of 21 December 2022 laying down a list of specific high-value datasets and the arrangements for their publication and re-use, Annex, Section 2
in scheme: High-value dataset categories
preferred label: Bio-geograafilised piirkonnad @et
preferred label: Bioģeogrāfiskie reģioni @lv
preferred label: Biogeografiske regioner @da
preferred label: Biogeografische Regionen @de
preferred label: Βιογεωγραφικές περιοχές @el
preferred label: Réigiúin bhithgheografacha @ga
preferred label: Regiony biogeograficzne @pl
preferred label: Biogeografiska regioner @sv
preferred label: Biogeográfiai régiók @hu
preferred label: Bioregiony @cs
preferred label: Régions biogéographiques @fr
preferred label: Biogeografske regije @sl
preferred label: Regiuni biogeografice @ro
preferred label: Regiões biogeográficas @pt
preferred label: Regiones biogeográficas @es
preferred label: Biomaantieteelliset alueet @fi
preferred label: Biogeografické regióny @sk
preferred label: Biogeografische gebieden @nl
preferred label: Biogeografiniai regionai @lt
preferred label: Reġjuni bijoġeografiċi @mt
preferred label: Regioni biogeografiche @it
preferred label: Биогеографски региони @bg

NWP model data
type: Concept
order: 0305
start date: 2019-07-06
created: 2024-05-17
broader: Meteorological
definition: data sets as described in Commission Implementing Regulation (EU) 2023/138 of 21 December 2022 laying down a list of specific high-value datasets and the arrangements for their publication and re-use, Annex, Section 3
in scheme: High-value dataset categories
preferred label: Gegevens van het NWP-model @nl
preferred label: Dati dei modelli NWP @it
preferred label: Dane z modeli NWP @pl
preferred label: Данни от модела на ЦМ @bg
preferred label: Data tal-mudelli tal-NWP @mt
preferred label: Údaje z modelu numerických předpovědí počasí @cs
preferred label: Δεδομένα μοντέλου NWP @el
preferred label: NWP modeļa dati @lv
preferred label: Podaci NPM-a @hr
preferred label: NWP-Modelldaten @de
preferred label: Date privind modelul NWP @ro
preferred label: Az NWP-modell adatai @hu
preferred label: Dados do modelo de previsão meteorológica numérica @pt
preferred label: Podatki modela za numerično napovedovanje vremena @sl
preferred label: Modelové údaje numerickej predpovede počasia @sk
preferred label: NWP-mallinnusdata @fi
preferred label: Sonraí eiseamláireacha NWP @ga
preferred label: NWP-modelldata @sv
preferred label: Modèles de données PNM @fr
preferred label: NWP-modeldata @da
preferred label: Datos del modelo PMN @es
preferred label: SOP modeliavimo duomenys @lt
preferred label: Arvutuspõhise ilmaennustuse mudeli andmed @et

Fertility
type: Concept
order: 0415
start date: 2019-07-06
created: 2024-05-17
broader: Statistics
definition: data sets as described in Commission Implementing Regulation (EU) 2023/138 of 21 December 2022 laying down a list of specific high-value datasets and the arrangements for their publication and re-use, Annex, Section 4
in scheme: High-value dataset categories
preferred label: Fécondité @fr
preferred label: Fertilitet @da
preferred label: Vruchtbaarheid @nl
preferred label: Gimstamumas @lt
preferred label: Fertilità @it
preferred label: Γονιμότητα @el
preferred label: Termékenység @hu
preferred label: Плодовитост @bg
preferred label: Syntyvyys @fi
preferred label: Fertilidad @es
preferred label: Fertilität @de
preferred label: Il-fertilità @mt
preferred label: Torthúlacht @ga
preferred label: Współczynnik płodności @pl
preferred label: Rodnost @sl
preferred label: Sündimus @et
preferred label: Plodnost @cs
preferred label: Fertilitatea @ro
preferred label: Fecundidade @pt
preferred label: Plodnosť @sk
preferred label: Dzimstība @lv

Other physical limitations on waterways
type: Concept
order: 060204
start date: 2019-07-06
created: 2024-05-21
broader: Inland waterways datasets
definition: data sets as described in Commission Implementing Regulation (EU) 2023/138 of 21 December 2022 laying down a list of specific high-value datasets and the arrangements for their publication and re-use, Annex, Section 6
in scheme: High-value dataset categories
preferred label: Teorainneacha fisiciúla eile ar uiscebhealaí @ga
preferred label: Druge fizične omejitve na plovnih poteh @sl
preferred label: Autres limitations physiques des voies navigables @fr
preferred label: Andre fysiske begrænsninger på vandvejene @da
preferred label: Други физически ограничения по водните пътища @bg
preferred label: Otras limitaciones físicas en las vías navegables @es
preferred label: Citi fiziski ierobežojumi ūdensceļos @lv
preferred label: Pozostałe ograniczenia fizyczne dróg wodnych @pl
preferred label: Limitazzjonijiet fiżiċi oħrajn fil-passaġġi fuq l-ilma @mt
preferred label: Ostala fizička ograničenja na vodnim putovima @hr
preferred label: Andere fysieke beperkingen op de waterweg @nl
preferred label: Sonstige physische Beschränkungen auf Wasserstraßen @de
preferred label: Altre limitazioni fisiche delle vie navigabili @it
preferred label: Další fyzická omezení na vodních cestách @cs
preferred label: Vízi utakon fennálló egyéb fizikai korlátozások @hu
preferred label: Kiti fiziniai vandens kelių apribojimai @lt
preferred label: Alte limitări fizice ale șenalelor navigabile @ro
preferred label: Outras limitações físicas da via navegável @pt
preferred label: Iné fyzické obmedzenia na vodných cestách @sk
preferred label: Andra fysiska begränsningar för vattenvägar @sv
preferred label: Muut väylien fyysiset rajoitukset @fi
preferred label: Muud füüsilised piirangud veeteedel @et
preferred label: Άλλοι φυσικοί περιορισμοί στις πλωτές οδούς @el
modified: 2024-09-26

Contours of locks and dams
type: Concept
order: 060222
start date: 2019-07-06
created: 2024-05-21
broader: Inland waterways datasets
definition: data sets as described in Commission Implementing Regulation (EU) 2023/138 of 21 December 2022 laying down a list of specific high-value datasets and the arrangements for their publication and re-use, Annex, Section 6
in scheme: High-value dataset categories
preferred label: Umrisse der Schleusen und Wehre @de
preferred label: Profili delle chiuse e delle dighe @it
preferred label: Comhrianta loc agus dambaí @ga
preferred label: Контури на шлюзове и язовирни стени @bg
preferred label: Περιγράμματα υδατοφρακτών και φραγμάτων @el
preferred label: Sulkujen ja patojen ääriviivat @fi
preferred label: Obrysy plavebných komôr a hrádzí @sk
preferred label: Lüüside ja tammide äärejooned @et
preferred label: Slūžu un dambju kontūras @lv
preferred label: A zsilipek és a gátak körvonalai @hu
preferred label: Omrids af sluser og dæmninger @da
preferred label: Ytterlinjer för slussar och fördämningar @sv
preferred label: Contours des écluses et des barrages @fr
preferred label: Kontorni tal-mgħalaq u tad-digi @mt
preferred label: Contornos de eclusas e barragens @pt
preferred label: Obrysy śluz i zapór @pl
preferred label: Šliuzų ir užtvankų kontūrai @lt
preferred label: Konture prevodnica i brana @hr
preferred label: Contouren van sluizen en dammen @nl
preferred label: Contornos de esclusas y presas @es
preferred label: Obrisi zapornic in jezov @sl
preferred label: Contururile ecluzelor și ale barajelor @ro
preferred label: Obrysy zdymadel a přehrad @cs

Harmonised Indices of consumer prices
type: Concept
order: 0406
start date: 2019-07-06
created: 2024-05-17
broader: Statistics
definition: data sets as described in Commission Implementing Regulation (EU) 2023/138 of 21 December 2022 laying down a list of specific high-value datasets and the arrangements for their publication and re-use, Annex, Section 4
in scheme: High-value dataset categories
preferred label: Zharmonizowane wskaźniki cen konsumpcyjnych @pl
preferred label: Хармонизирани индекси на потребителските цени @bg
preferred label: Geharmoniseerde indexcijfers van de consumptieprijzen @nl
preferred label: Suderinti vartotojų kainų indeksai @lt
preferred label: Indiċijiet armonizzati tal-prezzijiet għall- konsumatur @mt
preferred label: Indicii armonizați ai prețurilor de consum @ro
preferred label: Harmoniserat konsumentprisindex @sv
preferred label: Harmonizované indexy spotrebiteľských cien @sk
preferred label: Índice de precios de consumo armonizados @es
preferred label: Harmoniserede forbrugerprisindekser @da
preferred label: Harmonizirani indeksi potrošačkih cijena @hr
preferred label: Harmonizované indexy spotřebitelských cen @cs
preferred label: Harmonizirani indeksi cen življenjskih potrebščin @sl
preferred label: Tarbijahindade harmoneeritud indeks @et
preferred label: Harmonizált fogyasztói árindexek @hu
preferred label: Saskaņoti patēriņa cenu indeksi @lv
preferred label: Índices harmonizados de preços no consumidor @pt
preferred label: Yhdenmukaistetut kuluttajahintaindeksit @fi
preferred label: Indici dei prezzi al consumo armonizzati @it
preferred label: Innéacsanna comhchuibhithe praghsanna do thomhaltóirí @ga
preferred label: Indices des prix à la consommation harmonisés @fr
preferred label: Εναρμονισμένοι δείκτες τιμών καταναλωτή @el
preferred label: Harmonisierte Verbraucherpreisindizes @de

Fairway characteristics
type: Concept
order: 060201
start date: 2019-07-06
created: 2024-05-21
broader: Inland waterways datasets
definition: data sets as described in Commission Implementing Regulation (EU) 2023/138 of 21 December 2022 laying down a list of specific high-value datasets and the arrangements for their publication and re-use, Annex, Section 6
in scheme: High-value dataset categories
preferred label: Karakteristike plovnog puta @hr
preferred label: Χαρακτηριστικά πλωτής οδού @el
preferred label: Vaarwegkenmerken @nl
preferred label: Características de los canales navegables @es
preferred label: Hajóút jellemzői @hu
preferred label: Характеристики на фарватера @bg
preferred label: Faarvaatri tunnused @et
preferred label: Značilnosti plovne poti @sl
preferred label: Farledens egenskaper @sv
preferred label: Informācija par kuģu ceļu @lv
preferred label: Características do canal navegável @pt
preferred label: Caracteristicile șenalului navigabil @ro
preferred label: Väylän ominaispiirteet @fi
preferred label: Caratteristiche del canale navigabile @it
preferred label: Saintréithe seolbhealaigh @ga
preferred label: Karatteristiċi tal-kanal navigabbli @mt
preferred label: Charakteristiky plavebnej dráhy @sk
preferred label: Vlastnosti plavební dráhy @cs
preferred label: Fahrwassermerkmale @de
preferred label: Farvaterio savybės @lt
preferred label: Farvandets karakteristika @da
preferred label: Charakterystyka dróg wodnych @pl
preferred label: Caractéristiques du chenal @fr

Hydrography
type: Concept
order: 0201
start date: 2019-07-06
created: 2024-05-15
broader: Earth observation and environment
definition: data sets as described in Commission Implementing Regulation (EU) 2023/138 of 21 December 2022 laying down a list of specific high-value datasets and the arrangements for their publication and re-use, Annex, Section 2
in scheme: High-value dataset categories
preferred label: Хидрография @bg
preferred label: Υδρογραφία @el
preferred label: Vízrajz @hu
preferred label: Hydrographie @fr
preferred label: Idrografija @mt
preferred label: Hidrografija @hr
preferred label: Hidrogrāfija @lv
preferred label: Hydrografia @fi
preferred label: Hidrografia @pt
preferred label: Hydrograf @da
preferred label: Hydrografi @sv
preferred label: Vodopis @cs
preferred label: Hydrografie @nl
preferred label: Hidrografie @ro
preferred label: Idrografia @it
preferred label: Hidrografía @es
preferred label: Hüdrograafia @et
preferred label: Hidreagrafaíocht @ga
preferred label: Gewässernetz @de

Isolated dangers in the fairway/navigation channel under and above water
type: Concept
order: 060224
start date: 2019-07-06
created: 2024-05-21
broader: Inland waterways datasets
definition: data sets as described in Commission Implementing Regulation (EU) 2023/138 of 21 December 2022 laying down a list of specific high-value datasets and the arrangements for their publication and re-use, Annex, Section 6
in scheme: High-value dataset categories
preferred label: Isolierte Gefahrenstellen im Fahrwasser/in der Fahrrinne unter und über Wasser @de
preferred label: Granice plovnog puta/plovnog kanala @hr
preferred label: Posamezne nevarnosti na plovni poti/v navigacijskem kanalu pod vodo in nad njo @sl
preferred label: Punti del canale navigabile/di navigazione che presentano pericoli isolati emersi e sommersi @it
preferred label: Enskilda faror under och över vattenytan i farleden @sv
preferred label: Éléments isolés immergés et submergés du chenal navigable présentant un danger @fr
preferred label: Isolerede forhindringer under og over vandet i farvandet/sejlrenden @da
preferred label: Yksittäiset vedenalaiset/-päälliset vaaratekijät liikenneväylällä @fi
preferred label: Isoleeritud veealused ja -pealsed ohud faarvaatris/navigatsioonikanalis @et
preferred label: Puncte ale pasei de navigație/șenalului navigabil care prezintă pericole izolate situate sub nivelul apei și deasupra acestuia @ro
preferred label: Perikli iżolati matul il-kanal navigabbli ta’ taħt u ta’ fuq l-ilma @mt
preferred label: A hajóút, illetve csatorna határai @hu
preferred label: Izolované nebezpečenstvá v plavebnej dráhe/plavebnom kanáli pod a nad vodou @sk
preferred label: Μεμονωμένοι κίνδυνοι στην πλωτή οδό/κανάλι ναυσιπλοΐας που βρίσκονται κάτω και πάνω από την επιφάνεια του ύδατος @el
preferred label: Corrghuaiseacha sa seolbhealach/sa chainéal loingseoireachta faoi uisce agus os a chionn @ga
preferred label: Pojedyncze zagrożenia na drodze wodnej/w kanale nawigacyjnym pod i nad wodą @pl
preferred label: Perigos isolados submersos e à superfície no canal/via navegável @pt
preferred label: Geïsoleerde gevaarlijke objecten onder en boven water in de vaarweg/-geul @nl
preferred label: Изолирани подводни и надводни опасности по фарватера/плавателния канал @bg
preferred label: Peligros aislados en la vía navegable/en el canal de navegación bajo y sobre el agua @es
preferred label: Bīstamas vietas kuģu ceļā / navigācijas kanālā zem un virs ūdens @lv
preferred label: Izolovaná nebezpečí v plavební dráze / plavebním kanálu pod a nad hladinou @cs
preferred label: Tam tikros farvateryje (laivybos kanale) virš vandens ir po juo esančios pavojingos vietos @lt
modified: 2024-09-26

Elevation
type: Concept
order: 0203
start date: 2019-07-06
created: 2024-05-15
broader: Earth observation and environment
definition: data sets as described in Commission Implementing Regulation (EU) 2023/138 of 21 December 2022 laying down a list of specific high-value datasets and the arrangements for their publication and re-use, Annex, Section 2
in scheme: High-value dataset categories
preferred label: Höjd @sv
preferred label: Aukštis @lt
preferred label: Υψομετρία @el
preferred label: Höhe @de
preferred label: Elevație @ro
preferred label: Augstums @lv
preferred label: Airde @ga
preferred label: Visina @hr
preferred label: Digitalni model višin @sl
preferred label: Kõrgused @et
preferred label: Ukształtowanie terenu @pl
preferred label: Релеф @bg
preferred label: Korkeus @fi
preferred label: Elevazione @it
preferred label: Højde @da
preferred label: Elevazzjoni @mt
preferred label: Altitude @fr
preferred label: Nadmořská výška @cs
preferred label: Domborzat @hu
preferred label: Hoogte @nl
preferred label: Výška @sk
preferred label: Elevaciones @es

Buildings
type: Concept
order: 0104
start date: 2019-07-06
created: 2024-05-14
broader: Geospatial
definition: data sets as described in Commission Implementing Regulation (EU) 2023/138 of 21 December 2022 laying down a list of specific high-value datasets and the arrangements for their publication and re-use, Annex, Section 1
in scheme: High-value dataset categories
preferred label: Zgrade @hr
preferred label: Ēkas @lv
preferred label: Budynki @pl
preferred label: Edifícios @pt
preferred label: Stavby @sk
preferred label: Stavbe @sl
preferred label: Edifici @it
preferred label: Bygninger @da
preferred label: Clădiri @ro
preferred label: Κτίρια @el
preferred label: Rakennukset @fi
preferred label: Сгради @bg
preferred label: Bâtiments @fr
preferred label: Ehitised @et
preferred label: Edificios @es
preferred label: Gebouwen @nl
preferred label: Gebäude @de
preferred label: Budovy @cs
preferred label: Byggnader @sv
preferred label: Foirgnimh @ga
preferred label: Épületek @hu
preferred label: Pastatai @lt
preferred label: Bini @mt

Temporary obstructions in the fairway
type: Concept
order: 060210
start date: 2019-07-06
created: 2024-05-21
broader: Inland waterways datasets
definition: data sets as described in Commission Implementing Regulation (EU) 2023/138 of 21 December 2022 laying down a list of specific high-value datasets and the arrangements for their publication and re-use, Annex, Section 6
in scheme: High-value dataset categories
preferred label: Προσωρινά εμπόδια στην πλωτή οδό @el
preferred label: Vorübergehende Hindernisse im Fahrwasser @de
preferred label: Obstrucciones temporales en el canal @es
preferred label: Tymczasowe przeszkody na torach wodnych @pl
preferred label: Ajutised takistused faarvaatril @et
preferred label: Obstacole temporare pe șenalul navigabil @ro
preferred label: Īslaicīgi šķēršļi kuģa ceļā @lv
preferred label: Obstructions temporaires dans le chenal @fr
preferred label: Obstruções temporárias no canal navegável @pt
preferred label: Ostruzioni temporanee nel canale navigabile @it
preferred label: Privremene zapreke na plovnom putu @hr
preferred label: Tilapäiset esteet väylällä @fi
preferred label: Dočasné prekážky v plavebnej dráhe @sk
preferred label: Tillfälliga hinder i farleden @sv
preferred label: Laikinos kliūtys farvateryje @lt
preferred label: Ostakoli temporanji fil-kanal navigabbli @mt
preferred label: A hajóúton lévő ideiglenes akadályok @hu
preferred label: Временни препятствия по фарватера @bg
preferred label: Midlertidige forhindringer i farvandet @da
preferred label: Tijdelijke obstructies in het vaarwater @nl
preferred label: Baic shealadacha sa seolbhealach @ga
preferred label: Začasne ovire na plovnih poteh @sl
preferred label: Dočasné částečné uzávěry na vodní cestě @cs

Nature preservation and biodiversity
type: Concept
order: 0223
start date: 2019-07-06
created: 2024-05-17
broader: Earth observation and environment
definition: data sets as described in Commission Implementing Regulation (EU) 2023/138 of 21 December 2022 laying down a list of specific high-value datasets and the arrangements for their publication and re-use, Annex, Section 2
in scheme: High-value dataset categories
preferred label: Naturbeskyttelse og biodiversitet @da
preferred label: Preservação da natureza e biodiversidade @pt
preferred label: Dabas saglabāšana un bioloģiskā daudzveidība @lv
preferred label: Natuurbehoud en biodiversiteit @nl
preferred label: Conservazione della natura e biodiversità @it
preferred label: Il-preservazzjoni tan-natura u l-bijodiversità @mt
preferred label: Protección de la naturaleza y biodiversidad @es
preferred label: Διατήρηση της φύσης και βιοποικιλότητα @el
preferred label: Ochrona przyrody i różnorodność biologiczna @pl
preferred label: Természetvédelem és biológiai sokféleség @hu
preferred label: Опазване на природата и биоразнообразието @bg
preferred label: Ochrana přírody a biologická rozmanitost @cs
preferred label: Cosaint an dúlra agus an bhithéagsúlacht @ga
preferred label: Looduskaitse ja bioloogiline mitmekesisus @et
preferred label: Conservarea naturii și biodiversitatea @ro
preferred label: Ochrana prírody a biodiverzita @sk
preferred label: Protection de la nature et biodiversité @fr
preferred label: Naturskydd och biologisk mångfald @sv
preferred label: Gamtos išsaugojimas ir biologinė įvairovė @lt
preferred label: Ohranjanje narave in biotska raznovrstnost @sl
preferred label: Očuvanje prirode i bioraznolikost @hr
preferred label: Luonnon suojelu ja monimuotoisuus @fi
preferred label: Erhaltung der Natur und der biologischen Vielfalt @de

Companies and company ownership
type: Concept
order: 05
start date: 2019-07-06
created: 2023-09-05
definition: data sets as described in Commission Implementing Regulation (EU) 2023/138 of 21 December 2022 laying down a list of specific high-value datasets and the arrangements for their publication and re-use, Annex, Section 5
in scheme: High-value dataset categories
preferred label: Sociedades y propiedad de sociedades @es
preferred label: Entreprises et propriété d'entreprises @fr
preferred label: Unternehmen und Eigentümerschaft von Unternehmen @de
preferred label: Dati relativi alle imprese e alla proprietà delle imprese @it
preferred label: Družbe in lastništvo družb @sl
preferred label: Data dwar il-kumpanniji u l-proprjetà tal-kumpanniji @mt
preferred label: Uzņēmumi un uzņēmumu īpašumtiesības @lv
preferred label: Vállalati és vállalattulajdonosi adatok @hu
preferred label: Bendrovės ir bendrovių valdymas nuosavybės teise @lt
preferred label: Εταιρείες και ιδιοκτησιακό καθεστώς εταιρειών @el
preferred label: Дружества и собственост на дружествата @bg
preferred label: Dane dotyczące przedsiębiorstw i ich własności @pl
preferred label: Företag och företagsägande @sv
preferred label: Äriühingud ja äriühingu omandisuhted @et
preferred label: Domeniul Societăți și structura de proprietate a societăților @ro
preferred label: Bedrijven en eigendom van bedrijven @nl
preferred label: Cuideachtaí agus úinéireacht cuideachtaí @ga
preferred label: Virksomheder og virksomhedsejerskab @da
preferred label: Společnosti a vlastnictví společností @cs
preferred label: Empresas e propriedade de empresas @pt
preferred label: Trgovačka društva i vlasništvo nad trgovačkim društvima @hr
preferred label: Spoločnosti a vlastníctvo spoločností @sk
preferred label: Yritys- ja yritysten omistustiedot @fi
modified: 2024-05-17
top concept of: High-value dataset categories

Population
type: Concept
order: 0414
start date: 2019-07-06
created: 2024-05-17
broader: Statistics
definition: data sets as described in Commission Implementing Regulation (EU) 2023/138 of 21 December 2022 laying down a list of specific high-value datasets and the arrangements for their publication and re-use, Annex, Section 4
in scheme: High-value dataset categories
preferred label: População @pt
preferred label: Populația @ro
preferred label: Ludność @pl
preferred label: Bevolking @nl
preferred label: Popolazione @it
preferred label: Il-popolazzjoni @mt
preferred label: Población @es
preferred label: Népesség @hu
preferred label: Πληθυσμός @el
preferred label: Gyventojai @lt
preferred label: Stanovništvo @hr
preferred label: Население @bg
preferred label: Iedzīvotāju skaits @lv
preferred label: Daonra @ga
preferred label: Prebivalstvo @sl
preferred label: Bevölkerung @de
preferred label: Väestö @fi
preferred label: Populace @cs
preferred label: Rahvastik @et
preferred label: Populácia @sk
preferred label: Befolkning @da

Bank of waterway at mean water level
type: Concept
order: 060220
start date: 2019-07-06
created: 2024-05-21
broader: Inland waterways datasets
definition: data sets as described in Commission Implementing Regulation (EU) 2023/138 of 21 December 2022 laying down a list of specific high-value datasets and the arrangements for their publication and re-use, Annex, Section 6
in scheme: High-value dataset categories
preferred label: Όχθες της εσωτερικής πλωτής οδού σε μέση στάθμη υδάτων @el
preferred label: Margen de la vía navegable al nivel medio de agua @es
preferred label: Vandens kelio krantai esant vidutiniam vandens lygiui @lt
preferred label: Бряг на воден път при средно водно ниво @bg
preferred label: Ūdensceļa krasta līnijas (vidējā ūdens līmeņa stāvoklī) @lv
preferred label: Břeh vodní cesty při střední hladině vody @cs
preferred label: Ligne d’eau (en période de moyennes eaux) @fr
preferred label: Oeverlijn bij gemiddelde waterstand @nl
preferred label: Strandlinje vid medelvattenstånd @sv
preferred label: Bruach an uiscebhealaigh ag meán-uisceleibhéal @ga
preferred label: Brzeg drogi wodnej (przy średnim poziomie wody) @pl
preferred label: Obala vodnog puta (pri srednjem vodostaju) @hr
preferred label: Ufer der Wasserstraße bei Mittelwasser @de
preferred label: A vízi út partvonala közepes vízállásnál @hu
preferred label: Malul căii navigabile la nivel mediu al apelor @ro
preferred label: Vandvejens bred ved middelvandstand @da
preferred label: Veetee kallas (vee keskmisel tasemel) @et
preferred label: Vesiväylän rannat vedenkorkeuden ollessa keskimääräinen @fi
preferred label: Margem da via navegável ao nível médio da água @pt
preferred label: Sponde della via navigabile (a livello delle acque medie) @it
preferred label: Breg plovne poti ob povprečnem vodostaju @sl
preferred label: Xatt tal-passaġġ fuq l-ilma fil-livell medju tal-ilma @mt
preferred label: Breh vodnej cesty pri priemernej výške vodnej hladiny @sk

Production and industrial facilities
type: Concept
order: 0216
start date: 2019-07-06
created: 2024-05-17
broader: Earth observation and environment
definition: data sets as described in Commission Implementing Regulation (EU) 2023/138 of 21 December 2022 laying down a list of specific high-value datasets and the arrangements for their publication and re-use, Annex, Section 2
in scheme: High-value dataset categories
preferred label: Produktions- og industrifaciliteter @da
preferred label: Termelő és ipari létesítmények @hu
preferred label: Saoráidí táirgthe agus tionscail @ga
preferred label: Gamybos ir pramonės įrenginiai @lt
preferred label: Εγκαταστάσεις παραγωγής και βιομηχανικές εγκαταστάσεις @el
preferred label: Výrobní a průmyslová zařízení @cs
preferred label: Proizvodni in industrijski objekti in naprave @sl
preferred label: Faciliteiten voor productie en industrie @nl
preferred label: Lieux de production et sites industriels @fr
preferred label: Instalații de producție și industriale @ro
preferred label: Tuotanto- ja teollisuuslaitokset @fi
preferred label: Produktions- och industrianläggningar @sv
preferred label: Производствени и промишлени съоръжения @bg
preferred label: Produktions- und Industrieanlagen @de
preferred label: Výrobné a priemyselné zariadenia @sk
preferred label: Instalaciones de producción e industriales @es
preferred label: Faċilitajiet ta’ produzzjoni u industrijali @mt
preferred label: Ražošanas un rūpniecības iekārtas @lv
preferred label: Tootmis- ja tööstusrajatised @et
preferred label: Sustavi za proizvodnju i industriju @hr
preferred label: Instalações industriais e de produção @pt
preferred label: Obiekty produkcyjne i przemysłowe @pl
preferred label: Produzione e impianti industriali @it

National accounts – GDP main aggregates
type: Concept
order: 0407
start date: 2019-07-06
created: 2024-05-17
broader: Statistics
definition: data sets as described in Commission Implementing Regulation (EU) 2023/138 of 21 December 2022 laying down a list of specific high-value datasets and the arrangements for their publication and re-use, Annex, Section 4
in scheme: High-value dataset categories
preferred label: Kansantalouden tilinpito – BKT:n pääaggregaatit @fi
preferred label: Nationalräkenskaper – viktiga BNP-aggregat @sv
preferred label: Nationalregnskaber — vigtige BNP-aggregater @da
preferred label: Rahvamajanduse arvepidamine – SKP peamised koondnäitajad @et
preferred label: Kontijiet nazzjonali – l-aggregati ewlenin tal- PDG @mt
preferred label: Nationale rekeningen — belangrijkste aggregaten van het bbp @nl
preferred label: Comptes nationaux — principaux agrégats du PIB @fr
preferred label: Национални сметки — основни агрегати за БВП @bg
preferred label: Cuentas nacionales — principales agregados del PIB @es
preferred label: Contas nacionais – principais agregados do PIB @pt
preferred label: Conturile naționale – agregatele principale ale PIB-ului @ro
preferred label: Nacionālie konti – galvenie koprādītāji par IKP @lv
preferred label: Εθνικοί λογαριασμοί — κύρια συγκεντρωτικά μεγέθη του ΑΕΠ @el
preferred label: Nacionalinės sąskaitos. Pagrindiniai agreguoti BVP rodikliai @lt
preferred label: Volkswirtschaftliche Gesamtrechnungen – BIP-Hauptaggregate @de
preferred label: Národné účty – hlavné agregáty HDP @sk
preferred label: Cuntais náisiúnta – príomh-chomhiomláin OTI @ga
preferred label: Rachunki narodowe – główne agregaty PKB @pl
preferred label: Národní účty – hlavní souhrnné ukazatele HDP @cs
preferred label: Nemzeti számlák – a GDP főbb aggregátumai @hu
preferred label: Conti nazionali — principali aggregati del PIL @it
preferred label: Nacionalni računi – glavni agregati BDP-a @hr
preferred label: Nacionalni računi – temeljni agregati BDP @sl

Navigation rules and recommendations
type: Concept
order: 060208
start date: 2019-07-06
created: 2024-05-21
broader: Inland waterways datasets
definition: data sets as described in Commission Implementing Regulation (EU) 2023/138 of 21 December 2022 laying down a list of specific high-value datasets and the arrangements for their publication and re-use, Annex, Section 6
in scheme: High-value dataset categories
preferred label: Navigeerimiseeskirjad ja -soovitused @et
preferred label: Règles et recommandations de navigation @fr
preferred label: Navigacijska pravila in priporočila @sl
preferred label: Pravidlá navigácie a odporúčania @sk
preferred label: Normas y recomendaciones de navegación @es
preferred label: Navigatieregels en -aanbevelingen @nl
preferred label: Navigationsregler og -anbefalinger @da
preferred label: Regulamente și recomandări de navigație @ro
preferred label: Navigationsregler och rekommendationer @sv
preferred label: Navigācijas noteikumi un ieteikumi @lv
preferred label: Hajózási szabályok és ajánlások @hu
preferred label: Vorschriften und Empfehlungen für die Schifffahrt @de
preferred label: Rialacha agus moltaí loingseoireachta @ga
preferred label: Navigacijos taisyklės ir rekomendacijos @lt
preferred label: Навигационни правила и препоръки @bg
preferred label: Pravidla a doporučení týkající se plavby @cs
preferred label: Regole e raccomandazioni in materia di navigazione @it
preferred label: Κανόνες και συστάσεις ναυσιπλοΐας @el
preferred label: Regoli u rakkomandazzjonijiet tan-navigazzjoni @mt
preferred label: Pravila i preporuke za navigaciju @hr
preferred label: Regras e recomendações de navegação @pt
preferred label: Navigointisäännöt ja -suositukset @fi
preferred label: Zasady i zalecenia dotyczące żeglugi @pl

Horizontal legislation
type: Concept
order: 0227
start date: 2019-07-06
created: 2024-05-17
broader: Earth observation and environment
definition: data sets as described in Commission Implementing Regulation (EU) 2023/138 of 21 December 2022 laying down a list of specific high-value datasets and the arrangements for their publication and re-use, Annex, Section 2
in scheme: High-value dataset categories
preferred label: Legislazione orizzontale @it
preferred label: Horizontálne právne predpisy @sk
preferred label: Horizontale wetgeving @nl
preferred label: Horisontaalinen lainsäädäntö @fi
preferred label: Legislação horizontal @pt
preferred label: Хоризонтално законодателство @bg
preferred label: Horizontális jogszabályok @hu
preferred label: Legislación horizontal @es
preferred label: Reachtaíocht chothrománach @ga
preferred label: Legislația orizontală @ro
preferred label: Horizontāli tiesību akti @lv
preferred label: Horizontální právní předpisy @cs
preferred label: Leġiżlazzjoni orizzontali @mt
preferred label: Horisontaalsed õigusaktid @et
preferred label: Législation horizontale @fr
preferred label: Horizontale Rechtsvorschriften @de
preferred label: Horizontalna zakonodaja @sl
preferred label: Horisontal lovgivning @da
preferred label: Övergripande lagstiftning @sv
preferred label: Horizontalieji teisės aktai @lt
preferred label: Przepisy horyzontalne @pl
preferred label: Οριζόντια νομοθεσία @el
preferred label: Horizontalno zakonodavstvo @hr

Boundaries of the fairway/navigation channel
type: Concept
order: 060223
start date: 2019-07-06
created: 2024-05-21
broader: Inland waterways datasets
definition: data sets as described in Commission Implementing Regulation (EU) 2023/138 of 21 December 2022 laying down a list of specific high-value datasets and the arrangements for their publication and re-use, Annex, Section 6
in scheme: High-value dataset categories
preferred label: Granice plovnog puta/plovnog kanala @hr
preferred label: A hajóút, illetve csatorna határai @hu
preferred label: Граници на фарватера/плавателния канал @bg
preferred label: Limites du chenal navigable @fr
preferred label: Teorainneacha an tseolbhealaigh/an chainéil loingseoireachta @ga
preferred label: Fahrwasser-/Fahrrinnengrenzen @de
preferred label: Όρια της πλωτής οδού/καναλιού ναυσιπλοΐας @el
preferred label: Granice drogi wodnej/kanału żeglugowego @pl
preferred label: Kuģu ceļa/navigācijas kanāla robežas @lv
preferred label: Limitele pasei de navigație/șenalului navigabil @ro
preferred label: Hranice plavební dráhy / plavebního kanálu @cs
preferred label: Hranice plavebnej dráhy/plavebného kanálu @sk
preferred label: Faarvaatri/navigatsioonikanali piirid @et
preferred label: Liikenneväylän rajat @fi
preferred label: Limiti del canale navigabile/di navigazione @it
preferred label: Farvandets/sejlrendens afgrænsning @da
preferred label: Delimitações da via/canal navegável @pt
preferred label: Límites de la vía navegable/canal de navegación @es
preferred label: Meje plovne poti/navigacijskega kanala @sl
preferred label: Grenzen van de vaarweg/-geul @nl
preferred label: Konfini tal-kanal navigabbli @mt
preferred label: Farvaterio (laivybos kanalo) ribos @lt
preferred label: Gränser för farleden/navigationskanalen @sv

Short term changes of aids to navigation
type: Concept
order: 060215
start date: 2019-07-06
created: 2024-05-21
broader: Inland waterways datasets
definition: data sets as described in Commission Implementing Regulation (EU) 2023/138 of 21 December 2022 laying down a list of specific high-value datasets and the arrangements for their publication and re-use, Annex, Section 6
in scheme: High-value dataset categories
preferred label: Lühiajalised muutused navigatsiooniseadmetes @et
preferred label: A navigációs segédeszközök ideiglenes változásai @hu
preferred label: Краткосрочни промени на помощните навигационни средства @bg
preferred label: Modificări pe termen scurt ale asistenței pentru navigație @ro
preferred label: Kurzfristige Änderungen bei den Schifffahrtszeichen @de
preferred label: Athruithe gearrthéarmacha ar áiseanna loingseoireachta @ga
preferred label: Βραχυπρόθεσμες αλλαγές των βοηθημάτων πλοήγησης @el
preferred label: Kratkotrajne promjene navigacijskih sredstava @hr
preferred label: Kratkoročne spremembe navigacijskih pripomočkov @sl
preferred label: Kortvarige ændringer af navigationshjælpemidler @da
preferred label: Krátkodobé zmeny v pomocných navigačných mechanizmoch @sk
preferred label: Krátkodobé změny pomůcek pro plavbu @cs
preferred label: Alteração a curto prazo das ajudas à navegação @pt
preferred label: Cambiamenti a breve termine degli ausili alla navigazione @it
preferred label: Cambios a corto plazo de las ayudas a la navegación @es
preferred label: Tymczasowe zmiany w pomocach nawigacyjnych @pl
preferred label: Trumpalaikiai navigacijos įrenginių pasikeitimai @lt
preferred label: Navigoinnin turvalaitteiden lyhytaikaiset muutokset @fi
preferred label: Bidliet għal żmien qasir ta’ għajnuniet għan-navigazzjoni @mt
preferred label: Kortstondige wijzigingen in de vaarwegmarkering @nl
preferred label: Navigācijas līdzekļu izmaiņas īstermiņā @lv
preferred label: Changements à court terme des aides à la navigation @fr
preferred label: Förändringar på kort sikt av navigeringshjälpmedlen @sv

Water
type: Concept
order: 0226
start date: 2019-07-06
created: 2024-05-17
broader: Earth observation and environment
definition: data sets as described in Commission Implementing Regulation (EU) 2023/138 of 21 December 2022 laying down a list of specific high-value datasets and the arrangements for their publication and re-use, Annex, Section 2
in scheme: High-value dataset categories
preferred label: Voda @sk
preferred label: Água @pt
preferred label: Acqua @it
preferred label: Vatten @sv
preferred label: Vesi @et
preferred label: Eau @fr
preferred label: Apă @ro
preferred label: Wasser @de
preferred label: Ūdens @lv
preferred label: Víz @hu
preferred label: Ύδατα @el
preferred label: Vanduo @lt
preferred label: Woda @pl
preferred label: Vand @da
preferred label: L-ilma @mt
preferred label: Agua @es
preferred label: Uisce @ga
preferred label: Вода @bg

Company documents and accounts
type: Concept
order: 0502
start date: 2019-07-06
created: 2024-05-17
broader: Companies and company ownership
definition: data sets as described in Commission Implementing Regulation (EU) 2023/138 of 21 December 2022 laying down a list of specific high-value datasets and the arrangements for their publication and re-use, Annex, Section 5
in scheme: High-value dataset categories
preferred label: Documentos e contas das empresas @pt
preferred label: Dokumenty a účty spoločnosti @sk
preferred label: Documenti e conti aziendali @it
preferred label: Документи и отчети на дружеството @bg
preferred label: Virksomhedsdokumenter og -regnskaber @da
preferred label: Dokumenty i sprawozdania przedsiębiorstwa @pl
preferred label: Εταιρικά έγγραφα και λογαριασμοί @el
preferred label: Äriühingu dokumendid ja raamatupidamisaruanded @et
preferred label: Documentele și conturile societății @ro
preferred label: Doiciméid agus cuntais chuideachta @ga
preferred label: Documentos y cuentas de la empresa @es
preferred label: Vállalati dokumentumok és számviteli adatok @hu
preferred label: Dokumenti in računovodski izkazi družb @sl
preferred label: Dokumenty a účty společnosti @cs
preferred label: Dokumenti u kontijiet tal-kumpaniji @mt
preferred label: Dokumenti i financijski izvještaji društva @hr
preferred label: Bedrijfsdocumenten en -rekeningen @nl
preferred label: Bendrovių dokumentai ir sąskaitos @lt
preferred label: Företagshandlingar och räkenskaper @sv
preferred label: Documents et comptes de l’entreprise @fr
preferred label: Yritysasiakirjat ja tilinpäätökset @fi
preferred label: Uzņēmuma dokumenti un pārskati @lv
preferred label: Unternehmensunterlagen und -abschlüsse @de

Reference parcels
type: Concept
order: 0106
start date: 2019-07-06
created: 2024-05-14
broader: Geospatial
definition: data sets as described in Commission Implementing Regulation (EU) 2023/138 of 21 December 2022 laying down a list of specific high-value datasets and the arrangements for their publication and re-use, Annex, Section 1
in scheme: High-value dataset categories
preferred label: Referenčne parcele @sl
preferred label: Parcele de referință @ro
preferred label: Roqgħat ta’ referenza @mt
preferred label: Dáileachtaí tagartha @ga
preferred label: Αγροτεμάχια αναφοράς @el
preferred label: Võrdlusmaatükid @et
preferred label: Referenzparzellen @de
preferred label: Referenčné parcely @sk
preferred label: Parcelle di riferimento @it
preferred label: Referenciaparcellák @hu
preferred label: Referentiepercelen @nl
preferred label: Referenceparceller @da
preferred label: Referentne parcele @hr
preferred label: Parcelas de referencia @es
preferred label: Referenční pozemky @cs
preferred label: Viitelohkot @fi
preferred label: Atsauces zemes gabali @lv
preferred label: Referensskifte @sv
preferred label: Parcelas de referência @pt
preferred label: Działki referencyjne @pl
preferred label: Kontroliniai žemės sklypai @lt
preferred label: Референтни парцели @bg
preferred label: Parcelles de référence @fr

Emissions
type: Concept
order: 0222
start date: 2019-07-06
created: 2024-05-17
broader: Earth observation and environment
definition: data sets as described in Commission Implementing Regulation (EU) 2023/138 of 21 December 2022 laying down a list of specific high-value datasets and the arrangements for their publication and re-use, Annex, Section 2
in scheme: High-value dataset categories
preferred label: Emisje @pl
preferred label: Heited @et
preferred label: Emisii @ro
preferred label: Kibocsátás @hu
preferred label: Emissioni @it
preferred label: Emisijas @lv
preferred label: Emisie @sk
preferred label: Utsläpp @sv
preferred label: Astaíochtaí @ga
preferred label: Emissões @pt
preferred label: Εκπομπές @el
preferred label: Emisiones @es
preferred label: Päästöt @fi
preferred label: Emissioner @da
preferred label: Emissies @nl
preferred label: Емисии @bg
preferred label: Emise @cs
preferred label: Emissionen @de
preferred label: L-emissjonijiet @mt
preferred label: Emisije @hr
preferred label: Išmetamieji teršalai @lt
preferred label: Émissions @fr

Industrial production
type: Concept
order: 0401
start date: 2019-07-06
created: 2024-05-17
broader: Statistics
definition: data sets as described in Commission Implementing Regulation (EU) 2023/138 of 21 December 2022 laying down a list of specific high-value datasets and the arrangements for their publication and re-use, Annex, Section 4
in scheme: High-value dataset categories
preferred label: Produkcja przemysłowa @pl
preferred label: Industrieproduktion @de
preferred label: Produzzjoni industrijali @mt
preferred label: Priemyselná výroba @sk
preferred label: Production industrielle @fr
preferred label: Tööstustoodang @et
preferred label: Промишлено производство @bg
preferred label: Produzione industriale @it
preferred label: Industrijska proizvodnja @hr
preferred label: Producción industrial @es
preferred label: Βιομηχανική παραγωγή @el
preferred label: Pramonės produkcija @lt
preferred label: Industriproduktion @da
preferred label: Teollisuustuotanto @fi
preferred label: Produção industrial @pt
preferred label: Producția industrială @ro
preferred label: Táirgeadh tionsclaíoch @ga
preferred label: Průmyslová výroba @cs
preferred label: Industriële productie @nl
preferred label: Ipari termelés @hu
preferred label: Rūpnieciskā ražošana @lv

Administrative units
type: Concept
order: 0101
start date: 2019-07-06
created: 2024-05-14
broader: Geospatial
definition: data sets as described in Commission Implementing Regulation (EU) 2023/138 of 21 December 2022 laying down a list of specific high-value datasets and the arrangements for their publication and re-use, Annex, Section 1
in scheme: High-value dataset categories
preferred label: Unitajiet amministrattivi @mt
preferred label: Hallinnolliset yksiköt @fi
preferred label: Haldusüksused @et
preferred label: Unități administrative @ro
preferred label: Administratieve eenheden @nl
preferred label: Administrative enheder @da
preferred label: Aonaid riaracháin @ga
preferred label: Jednostki administracyjne @pl
preferred label: Správne jednotky @sk
preferred label: Административни единици @bg
preferred label: Správní jednotky @cs
preferred label: Közigazgatási egységek @hu
preferred label: Administrativa enheter @sv
preferred label: Verwaltungseinheiten @de
preferred label: Administraciniai vienetai @lt
preferred label: Διοικητικές ενότητες @el
preferred label: Upravne enote @sl
preferred label: Unidades administrativas @es
preferred label: Unités administratives @fr
preferred label: Unità amministrative @it
preferred label: Administratīvas vienības @lv
preferred label: Administrativne jedinice @hr

Environmental accounts and statistics
type: Concept
order: 0412
start date: 2019-07-06
created: 2024-05-17
broader: Statistics
definition: data sets as described in Commission Implementing Regulation (EU) 2023/138 of 21 December 2022 laying down a list of specific high-value datasets and the arrangements for their publication and re-use, Annex, Section 4
in scheme: High-value dataset categories
preferred label: Keskkonnamajanduslik arvepidamine ja statistika @et
preferred label: Környezeti számlák és statisztikák @hu
preferred label: Environmentálne účtovníctvo a štatistika @sk
preferred label: Conti e statistiche ambientali @it
preferred label: Ympäristötilinpito ja -tilastot @fi
preferred label: Contas e estatísticas ambientais @pt
preferred label: Vides konti un statistika @lv
preferred label: Miljöräkenskaper och miljöstatistik @sv
preferred label: Računi okoliša i statistički podaci @hr
preferred label: Cuentas y estadísticas medioambientales @es
preferred label: Cuntais agus staidreamh comhshaoil @ga
preferred label: Сметки и статистика за околната среда @bg
preferred label: Milieurekeningen en -statistieken @nl
preferred label: Aplinkos sąskaitos ir statistika @lt
preferred label: Conturile și statisticile de mediu @ro
preferred label: Environmentální účty a statistické údaje @cs
preferred label: Περιβαλλοντικοί λογαριασμοί και στατιστικές @el
preferred label: Okoljski računi in statistični podatki @sl
preferred label: Miljøregnskaber og -statistikker @da
preferred label: Umweltgesamtrechnungen und -statistiken @de
preferred label: Kontijiet u statistiki ambjentali @mt
preferred label: Rachunki i dane statystyczne dotyczące środowiska @pl
preferred label: Comptes et statistiques de l’environnement @fr

Basic company information: key attributes
type: Concept
order: 0501
start date: 2019-07-06
created: 2024-05-17
broader: Companies and company ownership
definition: data sets as described in Commission Implementing Regulation (EU) 2023/138 of 21 December 2022 laying down a list of specific high-value datasets and the arrangements for their publication and re-use, Annex, Section 5
in scheme: High-value dataset categories
preferred label: Alapvető vállalati információk: alapvető attribútumok @hu
preferred label: Informazzjoni bażika dwar il-kumpaniji: attributi ewlenin @mt
preferred label: Osnovne informacije o družbi: ključne lastnosti @sl
preferred label: Základní informace o společnosti: klíčové atributy @cs
preferred label: Äriühingu põhiteave: põhiatribuudid @et
preferred label: Βασικές πληροφορίες για την εταιρεία: βασικά χαρακτηριστικά @el
preferred label: Esminė informacija apie bendroves: pagrindiniai požymiai @lt
preferred label: Grundlæggende virksomhedsoplysninger: nøgleattributter @da
preferred label: Informații de bază privind societatea: atribute-cheie @ro
preferred label: Yritysten perustiedot: avainattribuutit @fi
preferred label: Podstawowe informacje na temat przedsiębiorstwa: kluczowe atrybuty @pl
preferred label: Informations de base sur l’entreprise Attributs clés @fr
preferred label: Informazioni di base sull'impresa: attributi chiave @it
preferred label: Grundläggande företagsinformation: nyckelattribut @sv
preferred label: Informações de base sobre as empresas: principais atributos @pt
preferred label: Osnovni podaci o trgovačkom društvu: ključni atributi @hr
preferred label: Grundlegende Angaben zum Unternehmen: Schlüsselattribute @de
preferred label: Základné informácie o spoločnosti: kľúčové vlastnosti @sk
preferred label: Información de contacto básica: principales atributos @es
preferred label: Bunfhaisnéis chuideachta: príomh-shaintréithe @ga
preferred label: Основна информация за дружеството: ключови атрибути @bg
preferred label: Basisbedrijfsinformatie: sleutelkenmerken @nl
preferred label: Pamatinformācija par uzņēmumu: pamatatribūti @lv

Consolidated government gross debt
type: Concept
order: 0411
start date: 2019-07-06
created: 2024-05-17
broader: Statistics
definition: data sets as described in Commission Implementing Regulation (EU) 2023/138 of 21 December 2022 laying down a list of specific high-value datasets and the arrangements for their publication and re-use, Annex, Section 4
in scheme: High-value dataset categories
preferred label: Julkinen bruttovelka @fi
preferred label: Konsoliderad offentlig bruttoskuld @sv
preferred label: Konsoliduota valdžios sektoriaus bendroji skola @lt
preferred label: Valitsemissektori konsolideeritud koguvõlg @et
preferred label: Konszolidált bruttó államadósság @hu
preferred label: Konsolidirani bruto javni dolg @sl
preferred label: Dívida bruta consolidada das administrações públicas @pt
preferred label: Konsolidovaný hrubý veřejný dluh @cs
preferred label: Ενοποιημένο ακαθάριστο δημόσιο χρέος @el
preferred label: Ollfhiachas rialtais comhdhlúite @ga
preferred label: Konsolidētais valdības bruto parāds @lv
preferred label: Konsolidirani državni bruto dug @hr
preferred label: Konsolidovaný hrubý verejný dlh @sk
preferred label: Deuda bruta consolidada de las Administraciones Públicas @es
preferred label: Skonsolidowany dług publiczny brutto @pl
preferred label: Debito pubblico lordo consolidato @it
preferred label: Dejn gross konsolidat tal-gvern @mt
preferred label: Datoria publică guvernamentală brută consolidată @ro
preferred label: Dette publique brute consolidée @fr
preferred label: Konsolidierte Bruttoverschuldung des Staates @de
preferred label: Geconsolideerde bruto-overheidsschuld @nl
preferred label: Konsolideret offentlig bruttogæld @da
preferred label: Консолидиран дълг на сектор „Държавно управление“ @bg

Mortality
type: Concept
order: 0416
start date: 2019-07-06
created: 2024-05-17
broader: Statistics
definition: data sets as described in Commission Implementing Regulation (EU) 2023/138 of 21 December 2022 laying down a list of specific high-value datasets and the arrangements for their publication and re-use, Annex, Section 4
in scheme: High-value dataset categories
preferred label: Mirstība @lv
preferred label: Mortalitás @hu
preferred label: Smrtnost @sl
preferred label: Смъртност @bg
preferred label: Mortalità @it
preferred label: Úmrtnost @cs
preferred label: Dødelighed @da
preferred label: Mortalitet @hr
preferred label: Mortalidad @es
preferred label: Mortalité @fr
preferred label: Sterfte @nl
preferred label: Úmrtnosť @sk
preferred label: Mortalitatea @ro
preferred label: Współczynnik śmiertelności @pl
preferred label: Il-mortalità @mt
preferred label: Mortlaíocht @ga
preferred label: Mortalidade @pt
preferred label: Suremus @et
preferred label: Θνησιμότητα @el
preferred label: Mortalität @de
preferred label: Kuolleisuus @fi
preferred label: Mirtingumas @lt

Inequality
type: Concept
order: 0419
start date: 2019-07-06
created: 2024-05-17
broader: Statistics
definition: data sets as described in Commission Implementing Regulation (EU) 2023/138 of 21 December 2022 laying down a list of specific high-value datasets and the arrangements for their publication and re-use, Annex, Section 4
in scheme: High-value dataset categories
preferred label: Ebavõrdsus @et
preferred label: Nelygybė @lt
preferred label: Nerovnost @cs
preferred label: Ungleichheit @de
preferred label: Ulighed @da
preferred label: Ojämlikhet @sv
preferred label: Nerovnosť @sk
preferred label: Neamh-chomhionannas @ga
preferred label: Disuguaglianza @it
preferred label: Ongelijkheid @nl
preferred label: Nierówności @pl
preferred label: Ανισότητα @el
preferred label: Nejednakost @hr
preferred label: Nevienlīdzība @lv
preferred label: Inegalitatea @ro
preferred label: Neenakost @sl
preferred label: Desigualdad @es
preferred label: Egyenlőtlenség @hu
preferred label: L-inugwaljanza @mt
preferred label: Inégalité @fr
preferred label: Eriarvoisuus @fi
preferred label: Неравенство @bg
preferred label: Desigualdade @pt

National accounts – key indicators on households
type: Concept
order: 0409
start date: 2019-07-06
created: 2024-05-17
broader: Statistics
in scheme: High-value dataset categories
preferred label: Nationalräkenskaper – viktiga indikatorer för hushåll @sv
preferred label: Nacionālie konti – galvenie rādītāji par mājsaimniecībām @lv
preferred label: Rahvamajanduse arvepidamine – kodumajapidamiste põhinäitajad @et
preferred label: Cuentas nacionales: principales indicadores sobre los hogares @es
preferred label: Nacionalinės sąskaitos. Pagrindiniai namų ūkių rodikliai @lt
preferred label: Národní účty – klíčové ukazatele zaměřené na domácnosti @cs
preferred label: Kansantalouden tilinpito – kotitalouksia koskevat keskeiset indikaattorit @fi
preferred label: Nationale rekeningen — kernindicatoren voor huishoudens @nl
preferred label: Conturile naționale – indicatori-cheie privind gospodăriile populației @ro
preferred label: Cuntais náisiúnta – príomhtháscairí maidir le teaghlaigh @ga
preferred label: Comptes nationaux — indicateurs clés sur les ménages @fr
preferred label: Národné účty – kľúčové ukazovatele, čo sa týka domácností @sk
preferred label: Nacionalni računi – ključni kazalniki za gospodinjstva @sl
preferred label: Volkswirtschaftliche Gesamtrechnungen – Schlüsselindikatoren für private Haushalte @de
preferred label: Национални сметки — ключови показатели за домакинствата @bg
preferred label: Kontijiet nazzjonali – l-indikaturi ewlenin dwar l-unitajiet domestiċi @mt
preferred label: Conti nazionali — indicatori chiave sulle famiglie @it
preferred label: Contas nacionais – principais indicadores sobre as famílias @pt
preferred label: Nacionalni računi – ključni pokazatelji o kućanstvima @hr
preferred label: Εθνικοί λογαριασμοί — βασικοί δείκτες για τα νοικοκυριά @el
preferred label: Nationalregnskaber — vigtige indikatorer for husholdninger @da
preferred label: Nemzeti számlák – a háztartásokra vonatkozó kiemelt mutatók @hu
preferred label: Rachunki narodowe – kluczowe wskaźniki dotyczące gospodarstw domowych @pl

Protected sites
type: Concept
order: 0202
start date: 2019-07-06
created: 2024-05-15
broader: Earth observation and environment
definition: data sets as described in Commission Implementing Regulation (EU) 2023/138 of 21 December 2022 laying down a list of specific high-value datasets and the arrangements for their publication and re-use, Annex, Section 2
in scheme: High-value dataset categories
preferred label: Skyddade områden @sv
preferred label: Sítios protegidos @pt
preferred label: Προστατευόμενες τοποθεσίες @el
preferred label: Chráněná území @cs
preferred label: Zavarovana območja @sl
preferred label: Siti protetti @it
preferred label: Zaštićene lokacije @hr
preferred label: Aizsargājamas teritorijas @lv
preferred label: Zone protejate @ro
preferred label: Saugomos teritorijos @lt
preferred label: Láithreáin chosanta @ga
preferred label: Suojellut alueet @fi
preferred label: Sites protégés @fr
preferred label: Защитени обекти @bg
preferred label: Schutzgebiete @de
preferred label: Obszary chronione @pl
preferred label: Lugares protegidos @es
preferred label: Chránené územia @sk
preferred label: Védett helyek @hu
preferred label: Kaitsealused kohad @et
preferred label: Beskyttede lokaliteter @da
preferred label: Beschermde gebieden @nl

Water depths contours in the navigation channel
type: Concept
order: 060209
start date: 2019-07-06
created: 2024-05-21
broader: Inland waterways datasets
definition: data sets as described in Commission Implementing Regulation (EU) 2023/138 of 21 December 2022 laying down a list of specific high-value datasets and the arrangements for their publication and re-use, Annex, Section 6
in scheme: High-value dataset categories
preferred label: Izobate u plovnom kanalu @hr
preferred label: Konturer av vattendjupen i navigeringskanalen @sv
preferred label: Batimetria nel canale di navigazione @it
preferred label: Kontorni ta’ fond fl-ilma fil-kanal ta’ navigazzjoni @mt
preferred label: Comhrianta doimhneachtaí uisce sa chainéal uiscebhealaigh @ga
preferred label: Veden korkeudet liikenneväylällä @fi
preferred label: Очертания на водните дълбочини на навигационната карта @bg
preferred label: Izobaty w kanale żeglugowym @pl
preferred label: Ūdens dziļuma rādītāji navigācijas kanālā @lv
preferred label: Vanddybdeprofiler i sejlrenden @da
preferred label: Navigacinio kanalo vandens gelmių kontūrai @lt
preferred label: Obrysy hĺbky vody v navigačnom kanáli @sk
preferred label: Dieptelijnen in de vaargeul @nl
preferred label: Batimetría de los canales de navegación @es
preferred label: Curvas isobatimétricas do canal navegável @pt
preferred label: A mederfenék kontúrja a kijelölt hajóút alatt @hu
preferred label: Batimetrie pentru canalul de navigație @ro
preferred label: Obrisi globine reke v navigacijskih kanalih @sl
preferred label: Bathymétrie dans le chenal de navigation @fr
preferred label: Καμπύλη του βάθους των υδάτων μέσα στο κανάλι ναυσιπλοΐας @el
preferred label: Tiefenlinien in der Fahrrinne @de
preferred label: Obrysy hloubky vody v plavebním kanálu @cs
preferred label: Veesügavusjooned navigatsioonikanalis @et

Soil
type: Concept
order: 0218
start date: 2019-07-06
created: 2024-05-17
broader: Earth observation and environment
definition: data sets as described in Commission Implementing Regulation (EU) 2023/138 of 21 December 2022 laying down a list of specific high-value datasets and the arrangements for their publication and re-use, Annex, Section 2
in scheme: High-value dataset categories
preferred label: Jord @da
preferred label: Boden @de
preferred label: Έδαφος @el
preferred label: Ħamrija @mt
preferred label: Gleba @pl
preferred label: Soluri @ro
preferred label: Tla @sl
preferred label: Mark @sv
preferred label: Pinnas @et
preferred label: Dirvožemis @lt
preferred label: Ithir @ga
preferred label: Bodem @nl
preferred label: Tlo @hr
preferred label: Augsne @lv
preferred label: Talaj @hu
preferred label: Pôda @sk
preferred label: Solo @pt
preferred label: Půda @cs
preferred label: Sols @fr
preferred label: Suelo @es
preferred label: Maaperä @fi
preferred label: Suolo @it
preferred label: Почва @bg

Oceanographic geographical features
type: Concept
order: 0215
start date: 2019-07-06
created: 2024-05-17
broader: Earth observation and environment
definition: data sets as described in Commission Implementing Regulation (EU) 2023/138 of 21 December 2022 laying down a list of specific high-value datasets and the arrangements for their publication and re-use, Annex, Section 2
in scheme: High-value dataset categories
preferred label: Elementi geografici oceanografici @it
preferred label: Oceanografiske/geografiske forhold @da
preferred label: Ωκεανογραφικά γεωγραφικά χαρακτηριστικά @el
preferred label: Ozeanografisch-geografische Kennwerte @de
preferred label: Okeanograafilis-geograafilised tunnusjooned @et
preferred label: Океанографски географски характеристики @bg
preferred label: Karatteristiċi ġeografiċi oċeanografiċi @mt
preferred label: Geografiska oceanografiska förhållanden @sv
preferred label: Rasgos geográficos oceanográficos @es
preferred label: Oceanográfiai földrajzi jellemzők @hu
preferred label: Oceanografsko-geografske značajke @hr
preferred label: Caractéristiques géographiques océanographiques @fr
preferred label: Warunki oceanograficzno-geograficzne @pl
preferred label: Gnéithe aigéaneolaíochta geografacha @ga
preferred label: Oceanografische geografische kenmerken @nl
preferred label: Caracteristici geografice oceanografice @ro
preferred label: Oceánografické geografické prvky @sk
preferred label: Zeměpisné oceánografické prvky @cs
preferred label: Oceanogeografske značilnosti @sl
preferred label: Características oceanográficas @pt
preferred label: Okeanogrāfiski ģeogrāfiskie raksturlielumi @lv
preferred label: Merentutkimuksen maantieteelliset ominaispiirteet @fi
preferred label: Okeanografinės geografinės sąlygos @lt

Long-time obstructions in the fairway and reliability
type: Concept
order: 060202
start date: 2019-07-06
created: 2024-05-21
broader: Inland waterways datasets
definition: data sets as described in Commission Implementing Regulation (EU) 2023/138 of 21 December 2022 laying down a list of specific high-value datasets and the arrangements for their publication and re-use, Annex, Section 6
in scheme: High-value dataset categories
preferred label: Ostakoli għal terminu twil fil-kanal navigabbli u l-affidabbiltà @mt
preferred label: Langdurige belemmeringen voor de vaarweg en betrouwbaarheid @nl
preferred label: Ilgalaikės kliūtys farvateryje ir patikimumas @lt
preferred label: Langvarige hindringer i farvandet og pålidelighed @da
preferred label: Μακροχρόνια εμπόδια στην πλωτή οδό και αξιοπιστία @el
preferred label: Baic fhadtéarmacha sa seolbhealach agus iontaofacht @ga
preferred label: Langzeitbehinderungen im Fahrweg und Zuverlässigkeit @de
preferred label: Dugotrajne zapreke na plovnom putu i pouzdanost @hr
preferred label: Obstruções prolongadas no canal navegável e fiabilidade @pt
preferred label: Трайни препятствия по фарватера и надеждност @bg
preferred label: Dlhodobé prekážky na plavebných dráhach a spoľahlivosť @sk
preferred label: Ilglaicīgi šķēršļi kuģa ceļā un drošība @lv
preferred label: Pikaajalised takistused faarvaatril ja usaldusväärsus @et
preferred label: Obstructions durables dans le chenal et fiabilité @fr
preferred label: Obstrucții de lungă durată în șenalul navigabil și fiabilitate @ro
preferred label: Dlouhodobé překážky na plavební dráze a spolehlivost @cs
preferred label: Långvariga hinder i farleden och tillförlitlighet @sv
preferred label: Obstrucciones de larga duración en el canal navegable y fiabilidad @es
preferred label: Väylän pitkäkestoiset kulkuesteet ja luotettavuus @fi
preferred label: Długoterminowe przeszkody na torach wodnych i niezawodność @pl
preferred label: Ostruzioni durature nel canale navigabile e affidabilità @it
preferred label: A hajóút tartós akadályozása és megbízhatóság @hu
preferred label: Dolgotrajne ovire na plovnih poteh in zanesljivost @sl

Sea regions
type: Concept
order: 0217
start date: 2019-07-06
created: 2024-05-17
broader: Earth observation and environment
definition: data sets as described in Commission Implementing Regulation (EU) 2023/138 of 21 December 2022 laying down a list of specific high-value datasets and the arrangements for their publication and re-use, Annex, Section 2
in scheme: High-value dataset categories
preferred label: Meeresregionen @de
preferred label: Havområder @da
preferred label: Merepiirkonnad @et
preferred label: Tengeri régiók @hu
preferred label: Merialueet @fi
preferred label: Regiones marinas @es
preferred label: Regiões marinhas @pt
preferred label: Морски региони @bg
preferred label: Θαλάσσιες περιοχές @el
preferred label: Réigiúin na mara @ga
preferred label: Morske regije @hr
preferred label: Regiony morskie @pl
preferred label: Reġjuni tal-baħar @mt
preferred label: Mořské oblasti @cs
preferred label: Jūrų regionai @lt
preferred label: Morské regióny @sk
preferred label: Regioni marine @it
preferred label: Havsområden @sv
preferred label: Regiuni maritime @ro
preferred label: Zeegebieden @nl
preferred label: Jūru reģioni @lv
preferred label: Régions maritimes @fr

Weather alerts
type: Concept
order: 0303
start date: 2019-07-06
created: 2024-05-17
broader: Meteorological
definition: data sets as described in Commission Implementing Regulation (EU) 2023/138 of 21 December 2022 laying down a list of specific high-value datasets and the arrangements for their publication and re-use, Annex, Section 3
in scheme: High-value dataset categories
preferred label: Προειδοποιήσεις για τον καιρό @el
preferred label: Ostrzeżenia pogodowe @pl
preferred label: Įspėjimai apie oro sąlygas @lt
preferred label: Meteorologická upozornění @cs
preferred label: Wetterwarnungen @de
preferred label: Brīdinājumi par laikapstākļiem @lv
preferred label: Weerwaarschuwingen @nl
preferred label: Upozorenja na opasne vremenske pojave @hr
preferred label: Twissijiet tat-temp @mt
preferred label: Säävaroitukset @fi
preferred label: Предупреждения във връзка с метеорологичните условия @bg
preferred label: Meteorologické výstrahy @sk
preferred label: Vejrvarslinger @da
preferred label: Foláirimh aimsire @ga
preferred label: Vremenska opozorila @sl
preferred label: Alerte meteorologice @ro
preferred label: Allerte meteorologiche @it
preferred label: Meteorológiai figyelmeztetések @hu
preferred label: Alertes météorologiques @fr
preferred label: Alertas meteorológicos @pt
preferred label: Avisos meteorológicos @es
preferred label: Vädervarningar @sv
preferred label: Ilmahoiatused @et

Air
type: Concept
order: 0220
start date: 2019-07-06
created: 2024-05-17
broader: Earth observation and environment
definition: data sets as described in Commission Implementing Regulation (EU) 2023/138 of 21 December 2022 laying down a list of specific high-value datasets and the arrangements for their publication and re-use, Annex, Section 2
in scheme: High-value dataset categories
preferred label: Levegő @hu
preferred label: Aria @it
preferred label: Ovzdušie @sk
preferred label: Vzduch @cs
preferred label: Lucht @nl
preferred label: Въздух @bg
preferred label: Õhk @et
preferred label: Ilma @fi
preferred label: Luft @da
preferred label: L-arja @mt
preferred label: Αέρας @el
preferred label: Powietrze @pl
preferred label: Oras @lt
preferred label: Aire @es
preferred label: Gaiss @lv
preferred label: Ar @pt
preferred label: Zrak @hr
preferred label: Aer @ga

Addresses
type: Concept
order: 0103
start date: 2019-07-06
created: 2024-05-14
broader: Geospatial
definition: data sets as described in Commission Implementing Regulation (EU) 2023/138 of 21 December 2022 laying down a list of specific high-value datasets and the arrangements for their publication and re-use, Annex, Section 1
in scheme: High-value dataset categories
preferred label: Naslovi @sl
preferred label: Adresses @fr
preferred label: Seoltaí @ga
preferred label: Adressen @de
preferred label: Adreses @lv
preferred label: Indirizzi @it
preferred label: Adresy @cs
preferred label: Adrese @hr
preferred label: Osoitteet @fi
preferred label: Destinatari @ro
preferred label: Direcciones @es
preferred label: Adresser @da
preferred label: Címek @hu
preferred label: Διευθύνσεις @el
preferred label: Адреси @bg
preferred label: Endereços @pt
preferred label: Aadressid @et
preferred label: Adresai @lt

Natural risk zones
type: Concept
order: 0214
start date: 2019-07-06
created: 2024-05-17
broader: Earth observation and environment
definition: data sets as described in Commission Implementing Regulation (EU) 2023/138 of 21 December 2022 laying down a list of specific high-value datasets and the arrangements for their publication and re-use, Annex, Section 2
in scheme: High-value dataset categories
preferred label: Områder med naturlige risici @da
preferred label: Gebiete mit naturbedingten Risiken @de
preferred label: Područja s prirodnim opasnostima @hr
preferred label: Dabas apdraudējuma zonas @lv
preferred label: Naturliga riskområden @sv
preferred label: Природни рискови зони @bg
preferred label: Criosanna riosca nádúrtha @ga
preferred label: Zone de risc natural @ro
preferred label: Zonas de risco natural @pt
preferred label: Looduslikud ohutsoonid @et
preferred label: Zone a rischio naturale @it
preferred label: Gebieden met natuurrisico’s @nl
preferred label: Zóny prírodného rizika @sk
preferred label: Luonnonriskialueet @fi
preferred label: Ζώνες φυσικών κινδύνων @el
preferred label: Żoni ta’ riskju naturali @mt
preferred label: Zonas de riesgos naturales @es
preferred label: Gamtinių pavojų zonos @lt
preferred label: Strefy zagrożenia naturalnego @pl
preferred label: Območja nevarnosti naravnih nesreč @sl
preferred label: Természeti kockázati zónák @hu
preferred label: Zones à risque naturel @fr
preferred label: Oblasti ohrožené přírodními riziky @cs

Tourism flows in Europe
type: Concept
order: 0405
start date: 2019-07-06
created: 2024-05-17
broader: Statistics
definition: data sets as described in Commission Implementing Regulation (EU) 2023/138 of 21 December 2022 laying down a list of specific high-value datasets and the arrangements for their publication and re-use, Annex, Section 4
in scheme: High-value dataset categories
preferred label: Flussi turistici in Europa @it
preferred label: Fluxos turísticos na Europa @pt
preferred label: Toeristenstromen in Europa @nl
preferred label: Przepływy turystyczne w Europie @pl
preferred label: Turiststrømme i Europa @da
preferred label: Turistflöden i Europa @sv
preferred label: Tourismusströme in Europa @de
preferred label: Matkailuvirrat Euroopassa @fi
preferred label: Flux touristique en Europe @fr
preferred label: Flujos turísticos en Europa @es
preferred label: Toky v cestovnom ruchu v Európe @sk
preferred label: Turizmo srautai Europoje @lt
preferred label: Fluxurile turistice din Europa @ro
preferred label: Туристически потоци в Европа @bg
preferred label: Flussi tat-turiżmu fl-Ewropa @mt
preferred label: Tūrisma plūsmas Eiropā @lv
preferred label: Toky cestovního ruchu v Evropě @cs
preferred label: Turisztikai forgalom Európában @hu
preferred label: Turistični tokovi v Evropi @sl
preferred label: Τουριστικές ροές στην Ευρώπη @el
preferred label: Turismivood Euroopas @et
preferred label: Turistički tokovi u Europi @hr
preferred label: Sreabha turasóireachta san Eoraip @ga
modified: 2024-09-26

Agricultural parcels
type: Concept
order: 0107
start date: 2019-07-06
created: 2024-05-14
broader: Geospatial
definition: data sets as described in Commission Implementing Regulation (EU) 2023/138 of 21 December 2022 laying down a list of specific high-value datasets and the arrangements for their publication and re-use, Annex, Section 1
in scheme: High-value dataset categories
preferred label: Mezőgazdasági parcellák @hu
preferred label: Poľnohospodárske parcely @sk
preferred label: Kmetijske parcele @sl
preferred label: Landbouwpercelen @nl
preferred label: Põllud @et
preferred label: Lauksaimniecības zemes gabali @lv
preferred label: Landwirtschaftliche Parzellen @de
preferred label: Земеделски парцели @bg
preferred label: Poljoprivredne parcele @hr
preferred label: Parcelles agricoles @fr
preferred label: Žemės ūkio paskirties sklypai @lt
preferred label: Parcele agricole @ro
preferred label: Działki rolne @pl
preferred label: Parcelas agrícolas @es
preferred label: Landbrugs-parceller @da
preferred label: Parcelle agricole @it
preferred label: Biċċiet raba’ @mt
preferred label: Zemědělské pozemky @cs
preferred label: Αγροτεμάχια @el
preferred label: Jordbruksskiften @sv
preferred label: Viljelylohkot @fi
preferred label: Dáileachtaí talmhaíochta @ga

Observations data measured by weather stations
type: Concept
order: 0301
start date: 2019-07-06
created: 2024-05-17
broader: Meteorological
definition: data sets as described in Commission Implementing Regulation (EU) 2023/138 of 21 December 2022 laying down a list of specific high-value datasets and the arrangements for their publication and re-use, Annex, Section 3
in scheme: High-value dataset categories
preferred label: Sonraí breathnóireachtaí arna dtomhas ag stáisiúin aimsire @ga
preferred label: Данни от наблюдения на метеорологични станции @bg
preferred label: Meteorológiai állomások által mért megfigyelési adatok @hu
preferred label: Podaci motrenja izmjereni na meteorološkim postajama @hr
preferred label: Meteorologijos stočių užfiksuoti stebėjimo duomenys @lt
preferred label: Δεδομένα παρατηρήσεων που μετρώνται από μετεωρολογικούς σταθμούς @el
preferred label: Meteoroloģiskajās stacijās iegūti novērojumu dati @lv
preferred label: Beobachtungsmessdaten von Wetterstationen @de
preferred label: Observatiegegevens gemeten door weerstations @nl
preferred label: Údaje z pozorování naměřené v meteorologických stanicích @cs
preferred label: Données d’observation mesurées par les stations météorologiques @fr
preferred label: Sääasemien mittausdata @fi
preferred label: Dati di osservazione misurati dalle stazioni meteorologiche @it
preferred label: Observationsdata som uppmätts av väderstationer @sv
preferred label: Údaje z pozorovaní vykonaných meteorologickými stanicami @sk
preferred label: Dados de observações medidos por estações meteorológicas @pt
preferred label: Dane z obserwacji prowadzonych przez stacje pogodowe @pl
preferred label: Date de observare măsurate de stațiile meteorologice @ro
preferred label: Data tal-osservazzjonijiet imkejla mill-istazzjonijiet tat-temp @mt
preferred label: Observationsdata fra vejrstationer @da
preferred label: Podatki o opazovanjih, izmerjenih na vremenskih postajah @sl
preferred label: Ilmajaamade mõõdetud vaatlusandmed @et
preferred label: Datos de observaciones medidos por estaciones meteorológicas @es

Environmental monitoring facilities
type: Concept
order: 0210
start date: 2019-07-06
created: 2024-05-17
broader: Earth observation and environment
definition: data sets as described in Commission Implementing Regulation (EU) 2023/138 of 21 December 2022 laying down a list of specific high-value datasets and the arrangements for their publication and re-use, Annex, Section 2
in scheme: High-value dataset categories
preferred label: Urządzenia do monitorowania środowiska @pl
preferred label: Instalații de supraveghere a mediului @ro
preferred label: Zařízení pro sledování životního prostředí @cs
preferred label: Keskkonnaseirerajatised @et
preferred label: Installations de suivi environnemental @fr
preferred label: Sustavi za nadzor okoliša @hr
preferred label: Anläggningar för miljöövervakning @sv
preferred label: Vides monitoringa iekārtas @lv
preferred label: Miljøovervågningsfaciliteter @da
preferred label: Umweltüberwachungseinrichtungen @de
preferred label: Instalaciones de observación del medio ambiente @es
preferred label: Naprave in objekti za monitoring okolja @sl
preferred label: Εγκαταστάσεις παρακολούθησης του περιβάλλοντος @el
preferred label: Zariadenia na monitorovanie životného prostredia @sk
preferred label: Instalações de monitorização do ambiente @pt
preferred label: Aplinkos stebėsenos priemonės @lt
preferred label: Milieubewakingsvoorzieningen @nl
preferred label: Съоръжения за управление на околната среда @bg
preferred label: Környezetvédelmi monitoringlétesítmények @hu
preferred label: Saoráidí faireacháin comhshaoil @ga
preferred label: Ympäristön tilan seurantalaitteet @fi
preferred label: Faċilitajiet ta’ monitoraġġ ambjentali @mt
preferred label: Impianti di monitoraggio ambientale @it

National accounts – key indicators on corporations
type: Concept
order: 0408
start date: 2019-07-06
created: 2024-05-17
broader: Statistics
definition: data sets as described in Commission Implementing Regulation (EU) 2023/138 of 21 December 2022 laying down a list of specific high-value datasets and the arrangements for their publication and re-use, Annex, Section 4
in scheme: High-value dataset categories
preferred label: Rahvamajanduse arvepidamine – ettevõtete põhinäitajad @et
preferred label: Nacionalni računi – ključni pokazatelji o društvima @hr
preferred label: Nacionalni računi – ključni kazalniki za gospodarske družbe @sl
preferred label: Comptes nationaux — indicateurs clés sur les sociétés @fr
preferred label: Национални сметки — ключови показатели за дружествата @bg
preferred label: Národní účty – klíčové ukazatele zaměřené na podniky @cs
preferred label: Kontijiet nazzjonali – indikaturi ewlenin dwar il-korporazzjonijiet @mt
preferred label: Rachunki narodowe – kluczowe wskaźniki dotyczące przedsiębiorstw @pl
preferred label: Cuentas nacionales: principales indicadores sobre las empresas @es
preferred label: Nationalräkenskaper – viktiga indikatorer för företag @sv
preferred label: Nemzeti számlák – a vállalatokra vonatkozó kiemelt mutatók @hu
preferred label: Nacionālie konti – galvenie rādītāji par sabiedrībām @lv
preferred label: Conti nazionali — indicatori chiave sulle società @it
preferred label: Národné účty – kľúčové ukazovatele, čo sa týka korporácií @sk
preferred label: Cuntais náisiúnta – príomhtháscairí maidir le corparáidí @ga
preferred label: Volkswirtschaftliche Gesamtrechnungen – Schlüsselindikatoren für Kapitalgesellschaften @de
preferred label: Εθνικοί λογαριασμοί — βασικοί δείκτες για τις εταιρείες @el
preferred label: Contas nacionais – principais indicadores sobre as sociedades @pt
preferred label: Nacionalinės sąskaitos. Pagrindiniai bendrovių rodikliai @lt
preferred label: Kansantalouden tilinpito – yrityksiä koskevat keskeiset indikaattorit @fi
preferred label: Nationalregnskaber — vigtige indikatorer for selskaber @da
preferred label: Nationale rekeningen — kernindicatoren inzake ondernemingen @nl
preferred label: Conturile naționale – indicatori-cheie privind societățile @ro

Noise
type: Concept
order: 0224
start date: 2019-07-06
created: 2024-05-17
broader: Earth observation and environment
definition: data sets as described in Commission Implementing Regulation (EU) 2023/138 of 21 December 2022 laying down a list of specific high-value datasets and the arrangements for their publication and re-use, Annex, Section 2
in scheme: High-value dataset categories
preferred label: Rumore @it
preferred label: Torann @ga
preferred label: Geluid @nl
preferred label: Θόρυβος @el
preferred label: Buller @sv
preferred label: Шум @bg
preferred label: Hałas @pl
preferred label: Bruit @fr
preferred label: Melu @fi
preferred label: Müra @et
preferred label: Ruido @es
preferred label: Hrup @sl
preferred label: Triukšmas @lt
preferred label: Zaj @hu
preferred label: L-istorbju @mt
preferred label: Støj @da
preferred label: Buka @hr
preferred label: Troksnis @lv
preferred label: Hluk @cs
preferred label: Zgomot @ro
preferred label: Lärm @de
preferred label: Ruído @pt

Poverty
type: Concept
order: 0418
start date: 2019-07-06
created: 2024-05-17
broader: Statistics
definition: data sets as described in Commission Implementing Regulation (EU) 2023/138 of 21 December 2022 laying down a list of specific high-value datasets and the arrangements for their publication and re-use, Annex, Section 4
in scheme: High-value dataset categories
preferred label: Il-faqar @mt
preferred label: Chudoba @cs
preferred label: Vaesus @et
preferred label: Armoede @nl
preferred label: Φτώχεια @el
preferred label: Armut @de
preferred label: Pobreza @es
preferred label: Fattigdom @da
preferred label: Bochtaineacht @ga
preferred label: Szegénység @hu
preferred label: Nabadzība @lv
preferred label: Povertà @it
preferred label: Sărăcia @ro
preferred label: Skurdas @lt
preferred label: Revščina @sl
preferred label: Siromaštvo @hr
preferred label: Ubóstwo @pl
preferred label: Бедност @bg
preferred label: Köyhyys @fi
preferred label: Pauvreté @fr

Area management / restriction / regulation zones & reporting units
type: Concept
order: 0207
start date: 2019-07-06
created: 2024-05-15
broader: Earth observation and environment
definition: data sets as described in Commission Implementing Regulation (EU) 2023/138 of 21 December 2022 laying down a list of specific high-value datasets and the arrangements for their publication and re-use, Annex, Section 2
in scheme: High-value dataset categories
preferred label: Zone sottoposte a gestione/limitazioni/regolamentazione e unità con obbligo di comunicare dati @it
preferred label: Zone de administrare / restricție / reglementare și unități de raportare @ro
preferred label: Zonas de gestão/restrição/regulamentação e unidades de reporte @pt
preferred label: Områden med särskild förvaltning/begränsningar/reglering samt enheter för rapportering @sv
preferred label: Управление на територията/ограничени/регулирани зони и отчетни единици @bg
preferred label: Zones de gestion, de restriction ou de réglementation et unités de déclaration @fr
preferred label: Správní oblasti / chráněná pásma / regulovaná území a jednotky podávající hlášení @cs
preferred label: Bewirtschaftungsgebiete/Schutzgebiete/geregelte Gebiete und Berichterstattungseinheiten @de
preferred label: Bainistíocht limistéar / srianadh / criosanna rialála & aonaid tuairiscithe @ga
preferred label: Območja upravljanja/zaprta območja/regulirana območja in poročevalske enote @sl
preferred label: Područja upravljanja/zaštićena područja/uređena područja i jedinice za izvještavanje @hr
preferred label: Gospodarowanie obszarem/strefy ograniczone/regulacyjne oraz jednostki sprawozdawcze @pl
preferred label: Żoni taħt ġestjoni / restrizzjoni / regolazzjoni u unitajiet ta’ rapportar @mt
preferred label: Ζώνες διαχείρισης / περιορισμού / ρύθμισης εκτάσεων και μονάδες αναφοράς @el
preferred label: Aluesuunnittelun, rajoitusten ja sääntelyn piiriin kuuluvat alueet ja raportointiyksiköt @fi
preferred label: Üldplaneering/piirangu-/reguleeritud tsoonid ja aruandlusüksused @et
preferred label: Apgabala pārvaldības/ierobežojumu / reglamentētas zonas un ziņošanas vienības @lv
preferred label: Területgazdálkodási/-korlátozási/-szabályozási övezetek és adatszolgáltató egységek @hu
preferred label: Spravované/obmedzené/regulované zóny a jednotky podávajúce správy @sk
preferred label: Tvarkomos teritorijos, ribojamos ir reglamentuojamos zonos bei vienetai, už kuriuos atsiskaitoma @lt
preferred label: Forvaltede og regulerede områder samt områder med brugsbegrænsning og indberetningsenheder @da
preferred label: Zonas sujetas a ordenación, a restricciones o reglamentaciones y unidades de notificación @es
preferred label: Gebiedsbeheer, gebieden waar beperkingen gelden, gereguleerde gebieden en rapportage-eenheden @nl

State of the rivers, canals, locks and bridges
type: Concept
order: 060212
start date: 2019-07-06
created: 2024-05-21
broader: Inland waterways datasets
definition: data sets as described in Commission Implementing Regulation (EU) 2023/138 of 21 December 2022 laying down a list of specific high-value datasets and the arrangements for their publication and re-use, Annex, Section 6
in scheme: High-value dataset categories
preferred label: A folyók, csatornák, zsilipek és hidak állapota @hu
preferred label: Estado dos rios, canais, eclusas e pontes @pt
preferred label: Upių, kanalų, šliuzų ir tiltų būklė @lt
preferred label: Stav řek, kanálů, zdymadel a mostů @cs
preferred label: Jokien, kanavien, sulkujen ja siltojen tila @fi
preferred label: Състояние на реките, каналите, шлюзовете и мостовете @bg
preferred label: Stanje rijeka, kanala, prevodnica i mostova @hr
preferred label: Staid na n-aibhneacha, na gcanálacha, na loc agus na ndroichead @ga
preferred label: Upju, kanālu, slūžu un tiltu stāvoklis @lv
preferred label: Starea fluviilor, canalelor, ecluzelor și podurilor @ro
preferred label: Estado de los ríos, canales, esclusas y puentes @es
preferred label: Stan rzek, kanałów, śluz i mostów @pl
preferred label: Jõgede, kanalite, lüüside ja sildade olukord @et
preferred label: Stav riek, kanálov, plavebných komôr a mostov @sk
preferred label: Zustand der Flüsse, Kanäle, Schleusen und Brücken @de
preferred label: Tillståndet för floder, kanaler, slussar och broar @sv
preferred label: Κατάσταση ποταμών, διαύλων, κλεισιάδων και γεφυρών @el
preferred label: Stanje rek, kanalov, zapornic in mostov @sl
preferred label: Toestand van de rivieren, kanalen, sluizen en bruggen @nl
preferred label: Stato di fiumi, canali, chiuse e ponti @it
preferred label: État des rivières, des canaux, des écluses et des ponts @fr
preferred label: Stat tax-xmajjar, tal-kanali, tal-mgħalaq u tal-pontijiet @mt
preferred label: Floders, kanalers, slusers og broers tilstand @da

Mineral resources
type: Concept
order: 0213
start date: 2019-07-06
created: 2024-05-17
broader: Earth observation and environment
definition: data sets as described in Commission Implementing Regulation (EU) 2023/138 of 21 December 2022 laying down a list of specific high-value datasets and the arrangements for their publication and re-use, Annex, Section 2
in scheme: High-value dataset categories
preferred label: Izvori minerala @hr
preferred label: Naudingosios iškasenos @lt
preferred label: Mineralfyndigheter @sv
preferred label: Recursos minerais @pt
preferred label: Ressources minérales @fr
preferred label: Минерални ресурси @bg
preferred label: Recursos minerales @es
preferred label: Mineralische Bodenschätze @de
preferred label: Minerale bronnen @nl
preferred label: Derīgo izrakteņu resursi @lv
preferred label: Nerostné suroviny @cs
preferred label: Maavarad @et
preferred label: Mineralressourcer @da
preferred label: Mineraalivarat @fi
preferred label: Mineralni viri @sl
preferred label: Zasoby mineralne @pl
preferred label: Zdroje nerastných surovín @sk
preferred label: Ορυκτοί πόροι @el
preferred label: Riżorsi Minerali @mt
preferred label: Resurse minerale @ro
preferred label: Risorse minerarie @it
preferred label: Acmhainní mianracha @ga
preferred label: Ásványi nyersanyagok @hu

Cadastral parcels
type: Concept
order: 0105
start date: 2019-07-06
created: 2024-05-14
broader: Geospatial
definition: data sets as described in Commission Implementing Regulation (EU) 2023/138 of 21 December 2022 laying down a list of specific high-value datasets and the arrangements for their publication and re-use, Annex, Section 1
in scheme: High-value dataset categories
preferred label: Γεωτεμάχια κτηματολογίου @el
preferred label: Fastighetsområden @sv
preferred label: Parcelle catastali @it
preferred label: Matrikulære parceller @da
preferred label: Katastrální parcely @cs
preferred label: Parcelles cadastrales @fr
preferred label: Kadastrale percelen @nl
preferred label: Dáileachtaí cadastracha @ga
preferred label: Кадастрални парцели @bg
preferred label: Katastarske čestice @hr
preferred label: Parcele cadastrale @ro
preferred label: Kataszteri parcellák @hu
preferred label: Kiinteistöt @fi
preferred label: Katastrálne parcely @sk
preferred label: Flurstücke/Grundstücke (Katasterparzellen) @de
preferred label: Kadastro sklypai @lt
preferred label: Parcelas catastrales @es
preferred label: Działki katastralne @pl
preferred label: Katastrske parcele @sl
preferred label: Roqgħat katastali @mt
preferred label: Katastriüksused @et
preferred label: Parcelas cadastrais @pt
preferred label: Kadastrāli zemes gabali @lv

Waste
type: Concept
order: 0225
start date: 2019-07-06
created: 2024-05-17
broader: Earth observation and environment
definition: data sets as described in Commission Implementing Regulation (EU) 2023/138 of 21 December 2022 laying down a list of specific high-value datasets and the arrangements for their publication and re-use, Annex, Section 2
in scheme: High-value dataset categories
preferred label: Hulladék @hu
preferred label: Abfall @de
preferred label: Affald @da
preferred label: Odpad @cs
preferred label: Jäätmed @et
preferred label: Residuos @es
preferred label: Jäte @fi
preferred label: Rifiuti @it
preferred label: Отпадъци @bg
preferred label: Odpadki @sl
preferred label: Déchets @fr
preferred label: Avfall @sv
preferred label: Resíduos @pt
preferred label: Otpad @hr
preferred label: Dramhaíl @ga
preferred label: Deșeuri @ro
preferred label: Odpady @pl
preferred label: Atliekos @lt
preferred label: Afval @nl
preferred label: Atkritumi @lv
preferred label: L-iskart @mt
preferred label: Απόβλητα @el

Transport networks
type: Concept
order: 0601
start date: 2019-07-06
created: 2024-05-21
broader: Mobility
definition: data sets as described in Commission Implementing Regulation (EU) 2023/138 of 21 December 2022 laying down a list of specific high-value datasets and the arrangements for their publication and re-use, Annex, Section 6
in scheme: High-value dataset categories
preferred label: Networks tat-trasport @mt
preferred label: Транспортни мрежи @bg
preferred label: Redes de transporte @es
preferred label: Prometna omrežja @sl
preferred label: Verkehrsnetze @de
preferred label: Liikenneverkot @fi
preferred label: Reti di trasporto @it
preferred label: Transporta tīkli @lv
preferred label: Dopravné siete @sk
preferred label: Δίκτυα μεταφορών @el
preferred label: Transpordivõrgud @et
preferred label: Transportnet @da
preferred label: Gréasáin iompair @ga
preferred label: Transporto tinklai @lt
preferred label: Rețele de transport @ro
preferred label: Vervoersnetwerken @nl
preferred label: Sieci transportowe @pl
preferred label: Prometne mreže @hr
preferred label: Transportnät @sv
preferred label: Közlekedési hálózatok @hu
preferred label: Dopravní sítě @cs
preferred label: Réseaux de transport @fr

Species distribution
type: Concept
order: 0219
start date: 2019-07-06
created: 2024-05-17
broader: Earth observation and environment
definition: data sets as described in Commission Implementing Regulation (EU) 2023/138 of 21 December 2022 laying down a list of specific high-value datasets and the arrangements for their publication and re-use, Annex, Section 2
in scheme: High-value dataset categories
preferred label: Repartizarea speciilor @ro
preferred label: Rozložení druhů @cs
preferred label: Dáileadh speiceas @ga
preferred label: A fajok megoszlása @hu
preferred label: Distribuição das espécies @pt
preferred label: Liikide jaotumine @et
preferred label: Raširenost vrsta @hr
preferred label: Arters utbredning @sv
preferred label: Verteilung der Arten @de
preferred label: Porazdelitev vrst @sl
preferred label: Spreiding van soorten @nl
preferred label: Distribución de las especies @es
preferred label: Distribuzzjoni tal-ispeċijiet @mt
preferred label: Répartition des espèces @fr
preferred label: Rūšių pasiskirstymas @lt
preferred label: Výskyt druhov @sk
preferred label: Distribuzione delle specie @it
preferred label: Разпределение на видовете @bg
preferred label: Artsfordeling @da
preferred label: Κατανομή ειδών @el
preferred label: Sugu izplatība @lv
preferred label: Rozmieszczenie gatunków @pl
preferred label: Lajien levinneisyys @fi

Government expenditure and revenue
type: Concept
order: 0410
start date: 2019-07-06
created: 2024-05-17
broader: Statistics
definition: data sets as described in Commission Implementing Regulation (EU) 2023/138 of 21 December 2022 laying down a list of specific high-value datasets and the arrangements for their publication and re-use, Annex, Section 4
in scheme: High-value dataset categories
preferred label: Dépenses et recettes des administrations publiques @fr
preferred label: Offentliga utgifter och inkomster @sv
preferred label: Offentlige udgifter og indtægter @da
preferred label: Valitsemissektori kulud ja tulud @et
preferred label: Δαπάνες και έσοδα της κυβέρνησης @el
preferred label: Despesas e receitas das administrações públicas @pt
preferred label: Overheidsuitgaven en -ontvangsten @nl
preferred label: Wydatki i dochody sektora instytucji rządowych i samorządowych @pl
preferred label: Valdžios sektoriaus išlaidos ir pajamos @lt
preferred label: Výdaje a příjmy vládních institucí @cs
preferred label: Nefqa u dħul tal-gvern @mt
preferred label: Državni izdaci i prihodi @hr
preferred label: Spese ed entrate delle amministrazioni pubbliche @it
preferred label: Caiteachas agus ioncam rialtais @ga
preferred label: Държавни разходи и приходи @bg
preferred label: Ausgaben und Einnahmen des Staates @de
preferred label: Julkisyhteisöjen menot ja tulot @fi
preferred label: Államháztartási kiadások és bevételek @hu
preferred label: Gastos e ingresos públicos @es
preferred label: Cheltuielile și veniturile administrației publice @ro
preferred label: Izdatki in prihodki države @sl
preferred label: Valdības izdevumi un ieņēmumi @lv
preferred label: Výdavky a príjmy verejnej správy @sk

Habitats and biotopes
type: Concept
order: 0211
start date: 2019-07-06
created: 2024-05-17
broader: Earth observation and environment
definition: data sets as described in Commission Implementing Regulation (EU) 2023/138 of 21 December 2022 laying down a list of specific high-value datasets and the arrangements for their publication and re-use, Annex, Section 2
in scheme: High-value dataset categories
preferred label: Местообитания и биотопи @bg
preferred label: Hábitats y biotopos @es
preferred label: Gnáthóga agus bitóip @ga
preferred label: Staništa i biotopi @hr
preferred label: Habitats e biótopos @pt
preferred label: Stanoviště a biotopy @cs
preferred label: Naturtyper och biotoper @sv
preferred label: Dzīvotnes un biotopi @lv
preferred label: Siedliska i obszary przyrodniczo jednorodne @pl
preferred label: Habitat e biotopi @it
preferred label: Habitats en biotopen @nl
preferred label: Habitats et biotopes @fr
preferred label: Elinympäristöt ja biotoopit @fi
preferred label: Lebensräume und Biotope @de
preferred label: Levesteder og biotoper @da
preferred label: Élőhelyek és biotópok @hu
preferred label: Habitati in biotopi @sl
preferred label: Habitate și biotopuri @ro
preferred label: Elupaigad ja biotoobid @et
preferred label: Buveinės ir biotopai @lt
preferred label: Habitaty a biotopy @sk
preferred label: Ħabitats naturali u bijotopi @mt
preferred label: Ενδιαιτήματα και βιότοποι @el

Present and future water levels at gauges
type: Concept
order: 060211
start date: 2019-07-06
created: 2024-05-21
broader: Inland waterways datasets
definition: data sets as described in Commission Implementing Regulation (EU) 2023/138 of 21 December 2022 laying down a list of specific high-value datasets and the arrangements for their publication and re-use, Annex, Section 6
in scheme: High-value dataset categories
preferred label: Níveis da água atuais e previsíveis nos fluviómetros @pt
preferred label: Nuværende og kommende vandstand ved målepunkter @da
preferred label: Huidige en toekomstige waterstand bij meetpunten @nl
preferred label: A vízmércéknél érvényes aktuális és jövőbeni vízállások @hu
preferred label: Nuvarande och framtida vattennivåer vid vattennivåmätare @sv
preferred label: Gegenwärtige und zukünftige Wasserstände an den Pegeln @de
preferred label: Jooksvad ja prognoositavad veetasemenäidud mõõturitel @et
preferred label: Сегашни и бъдещи нива на водите при рейките @bg
preferred label: Niveles de agua actuales y futuros en los indicadores @es
preferred label: Poziomy wody na wodowskazach, obecne i przewidywane @pl
preferred label: Pašreizējais un paredzamais ūdens līmenis atbilstoši mērinstrumentu rādījumiem @lv
preferred label: Sadašnji i budući vodostaji na mjernim postajama @hr
preferred label: Livelli idrometrici attuali e futuri agli idrometri @it
preferred label: Leibhéil uisce reatha agus todhchaí ag tomhais @ga
preferred label: Stávající a budoucí vodní stavy u vodočtů @cs
preferred label: Livelli tal-ilma fil-preżent u fil-ġejjieni fl-idrometri @mt
preferred label: Nivele actuale și viitoare ale apei la indicatoarele hidrometrice @ro
preferred label: Sedanji in prihodnji vodostaji pri merilnih napravah @sl
preferred label: Tämänhetkiset ja tulevat veden korkeudet mittareissa @fi
preferred label: Esamas ir prognozuojamas vandens lygis ties matavimo stotimis @lt
preferred label: Τρέχουσα και μελλοντική στάθμη των υδάτων στους μετρητές στάθμης των υδάτων @el
preferred label: Súčasná a budúca výška vodnej hladiny vo vodomerných staniciach @sk
preferred label: Niveaux des eaux actuels et futurs aux points clés @fr
modified: 2024-09-26

Potential labour force
type: Concept
order: 0422
start date: 2019-07-06
created: 2024-05-17
broader: Statistics
definition: data sets as described in Commission Implementing Regulation (EU) 2023/138 of 21 December 2022 laying down a list of specific high-value datasets and the arrangements for their publication and re-use, Annex, Section 4
in scheme: High-value dataset categories
preferred label: Forța de muncă potențială @ro
preferred label: Potenciali darbo jėga @lt
preferred label: Potentiële beroepsbevolking @nl
preferred label: Δυνητικό εργατικό δυναμικό @el
preferred label: Il-forza tax-xogħol potenzjali @mt
preferred label: Potencialno delovno silo @sl
preferred label: Potentiell arbetskraft @sv
preferred label: Potenciální pracovní síla @cs
preferred label: Potenciálna pracovná sila @sk
preferred label: Potenzielle Arbeitskräfte @de
preferred label: Mano de obra potencial @es
preferred label: Mão de obra potencial @pt
preferred label: Potentiel arbejdsstyrke @da
preferred label: Lucht saothair féideartha @ga
preferred label: Potencijalna radna snaga @hr
preferred label: Forza lavoro potenziale @it
preferred label: Main-d’œuvre potentielle @fr
preferred label: Potentsiaalne tööjõud @et
preferred label: Потенциална работна сила @bg
preferred label: Potenciālais darbaspēks @lv
preferred label: Potenciális munkaerő @hu
preferred label: Potencjalne zasoby pracy @pl
preferred label: Potentiaalinen työvoima @fi
modified: 2024-09-26

List of navigation aids and traffic signs
type: Concept
order: 060207
start date: 2019-07-06
created: 2024-05-21
broader: Inland waterways datasets
definition: data sets as described in Commission Implementing Regulation (EU) 2023/138 of 21 December 2022 laying down a list of specific high-value datasets and the arrangements for their publication and re-use, Annex, Section 6
in scheme: High-value dataset categories
preferred label: Seznam pomůcek pro plavbu a dopravního značení @cs
preferred label: Zoznam navigačnej pomoci a dopravného značenia @sk
preferred label: Navigációs segédeszközök és forgalmi jelzések jegyzéke @hu
preferred label: Liste des aides à la navigation et signaux de trafic @fr
preferred label: Κατάλογος βοηθημάτων πλοήγησης και σημάτων κυκλοφορίας @el
preferred label: Navigacijos įrenginių ir eismo ženklų sąrašas @lt
preferred label: Liste der Navigationshilfen und Verkehrszeichen @de
preferred label: Lista das ajudas à navegação e sinais de trânsito @pt
preferred label: Luettelo navigoinnin apuvälineistä ja liikenneopasteista @fi
preferred label: Elenco degli ausili alla navigazione e dei segnali di traffico @it
preferred label: Lista dispozitivelor de asistență în navigație și a indicatoarelor de circulație @ro
preferred label: Förteckning över navigationshjälpmedel och trafikskyltar @sv
preferred label: Wykaz pomocy nawigacyjnych i znaków żeglugowych regulacji ruchu @pl
preferred label: Lijst van navigatiehulpmiddelen en verkeersborden @nl
preferred label: Liosta d’áiseanna loingseoireachta agus comharthaí tráchta @ga
preferred label: Seznam navigacijskih pripomočkov in prometnih znakov @sl
preferred label: Popis navigacijskih sredstava i prometnih znakova @hr
preferred label: Lista ta’ għajnuniet għan-navigazzjoni u tas-sinjali tat-traffiku @mt
preferred label: Liste over navigationshjælpemidler og trafikskilte @da
preferred label: Списък на навигационните помощни средства и пътните знаци @bg
preferred label: Lista de ayudas a la navegación y señales de tráfico @es
preferred label: Navigācijas līdzekļu un ceļa zīmju saraksts @lv
preferred label: Navigatsiooniseadmete ja liiklusmärkide loetelu @et

Restrictions caused by flood and ice
type: Concept
order: 060213
start date: 2019-07-06
created: 2024-05-21
broader: Inland waterways datasets
definition: data sets as described in Commission Implementing Regulation (EU) 2023/138 of 21 December 2022 laying down a list of specific high-value datasets and the arrangements for their publication and re-use, Annex, Section 6
in scheme: High-value dataset categories
preferred label: Ograniczenia spowodowane powodziami i lodem @pl
preferred label: Plūdu un ledus radītie šķēršļi @lv
preferred label: Apribojimai dėl potvynio ir ledo @lt
preferred label: Tulvien ja jään aiheuttamat rajoitukset @fi
preferred label: Beschränkungen infolge von Hochwasser und Eis @de
preferred label: Restricciones causadas por inundaciones y hielo @es
preferred label: Ограничения, причинени от разливи и ледове @bg
preferred label: Restrizzjonijiet ikkawżati minn għargħar u silġ @mt
preferred label: Begränsningar orsakade av översvämningar och is @sv
preferred label: Περιορισμοί λόγω πλημμύρας και πάγου @el
preferred label: Omejitve zaradi poplav in ledu @sl
preferred label: Omezení způsobená povodní a ledem @cs
preferred label: Obmedzenia spôsobené záplavami a ľadom @sk
preferred label: Ograničenja zbog poplava i leda @hr
preferred label: Restriktioner som følge af højvande og is @da
preferred label: Restricții cauzate de inundații și gheață @ro
preferred label: Srianta de dheasca tuile agus oighir @ga
preferred label: Restrições por motivo de cheia ou presença de gelo @pt
preferred label: Áradás és jégveszély miatti korlátozások @hu
preferred label: Üleujutused ja jääoludest tingitud piirangud @et
preferred label: Beperkingen door hoogwater en ijsvorming @nl
preferred label: Restrizioni provocate da piene e ghiaccio @it
preferred label: Restrictions causées par inondations et glace @fr

Regular lock and bridge operating times
type: Concept
order: 060205
start date: 2019-07-06
created: 2024-05-21
broader: Inland waterways datasets
definition: data sets as described in Commission Implementing Regulation (EU) 2023/138 of 21 December 2022 laying down a list of specific high-value datasets and the arrangements for their publication and re-use, Annex, Section 6
in scheme: High-value dataset categories
preferred label: Reguliere bedieningstijden van sluizen en bruggen @nl
preferred label: Réanna oibrithe loc agus droichead tráthrialta @ga
preferred label: Rozkład godzin eksploatacji śluz i mostów @pl
preferred label: Regelbundna driftstider för slussar och broar @sv
preferred label: Įprastas šliuzų ir tiltų darbo laikas @lt
preferred label: Normale driftstider for sluser og broer @da
preferred label: Redovno radno vrijeme prevodnica i mostova @hr
preferred label: A zsilipek és a hidak rendes üzemideje @hu
preferred label: Ore normale de exploatare a ecluzelor și podurilor @ro
preferred label: Običajni čas obratovanja zapornic in mostov @sl
preferred label: Ħinijiet regolari ta’ operazzjoni ta’ mgħalaq u ta’ pontijiet @mt
preferred label: Sulkujen ja siltojen säännölliset aukioloajat @fi
preferred label: Horário normal de serviço de eclusas e pontes @pt
preferred label: Noteiktais slūžu un tiltu darbības laiks @lv
preferred label: Horaires réguliers des écluses et des ponts @fr
preferred label: Pravidelné provozní doby plavebních komor a mostů @cs
preferred label: Редовно работно време на шлюзовете и мостовете @bg
preferred label: Pravidelné prevádzkové časy plavebných komôr a mostov @sk
preferred label: Normale Betriebszeiten der Schleusen und Brücken @de
preferred label: Horarios programados de esclusas y puentes @es
preferred label: Orari di servizio normali di chiuse e ponti @it
preferred label: Συνήθεις ώρες λειτουργίας κλεισιάδων και γεφυρών @el
preferred label: Tavapärased lüüside ja sildade toimimisajad @et

Land cover
type: Concept
order: 0205
start date: 2019-07-06
created: 2024-05-15
broader: Earth observation and environment
definition: data sets as described in Commission Implementing Regulation (EU) 2023/138 of 21 December 2022 laying down a list of specific high-value datasets and the arrangements for their publication and re-use, Annex, Section 2
in scheme: High-value dataset categories
preferred label: Kopertura tal-art @mt
preferred label: Κάλυψη γης @el
preferred label: Copertura del suolo @it
preferred label: Maakate @et
preferred label: Cumhdach talún @ga
preferred label: Arealdække @da
preferred label: Žemės danga @lt
preferred label: Occupation des terres @fr
preferred label: Земна покривка @bg
preferred label: Cubierta terrestre @es
preferred label: Krajinná pokrývka @sk
preferred label: Bodenbedeckung @de
preferred label: Landtäcke @sv
preferred label: Bodemgebruik @nl
preferred label: Użytkowanie terenu @pl
preferred label: Zemes pārklājums @lv
preferred label: Pokrovnost tal @sl
preferred label: Prekrivenost tla @hr
preferred label: Krajinný pokryv @cs
preferred label: A felszín borítása @hu
preferred label: Acoperire terestră @ro
preferred label: Maanpeite @fi
preferred label: Ocupação do solo @pt

Current healthcare expenditure
type: Concept
order: 0417
start date: 2019-07-06
created: 2024-05-17
broader: Statistics
definition: data sets as described in Commission Implementing Regulation (EU) 2023/138 of 21 December 2022 laying down a list of specific high-value datasets and the arrangements for their publication and re-use, Annex, Section 4
in scheme: High-value dataset categories
preferred label: Wydatki bieżące na ochronę zdrowia @pl
preferred label: Folyó egészségügyi kiadások @hu
preferred label: Tekući troškovi zdravstvene zaštite @hr
preferred label: Běžné výdaje na zdravotní péči @cs
preferred label: Tervishoiu jooksevkulud @et
preferred label: Spesa corrente per l'assistenza sanitaria @it
preferred label: In-nefqa kurrenti fuq il-kura tas-saħħa @mt
preferred label: Текущи разходи за здравеопазване @bg
preferred label: Aktuelle udgifter til sundhedspleje @da
preferred label: Τρέχουσες δαπάνες για υγειονομική περίθαλψη @el
preferred label: Cheltuielile actuale cu asistența medicală @ro
preferred label: Dépenses de santé courantes @fr
preferred label: Caiteachas cúraim sláinte reatha @ga
preferred label: Bežné výdavky na zdravotnú starostlivosť @sk
preferred label: Huidige uitgaven voor gezondheidszorg @nl
preferred label: Tekoči izdatki za zdravstveno varstvo @sl
preferred label: Faktiskie veselības aprūpes izdevumi @lv
preferred label: Despesas correntes com cuidados de saúde @pt
preferred label: Juoksevat terveydenhuoltomenot @fi
preferred label: Einamosios sveikatos priežiūros išlaidos @lt
preferred label: Gasto sanitario corriente @es
preferred label: Laufende Gesundheitsausgaben @de
preferred label: Löpande utgifter för hälso- och sjukvård @sv

Location and characteristics of ports and transhipment sites
type: Concept
order: 060206
start date: 2019-07-06
created: 2024-05-21
broader: Inland waterways datasets
definition: data sets as described in Commission Implementing Regulation (EU) 2023/138 of 21 December 2022 laying down a list of specific high-value datasets and the arrangements for their publication and re-use, Annex, Section 6
in scheme: High-value dataset categories
preferred label: Post u karatteristiċi tal-portijiet u tas-siti tat-trażbord @mt
preferred label: Položaj i karakteristike luka i dokova za pretovar @hr
preferred label: Emplacement et caractéristiques des ports et des sites de transbordement @fr
preferred label: Amplasarea și caracteristicile porturilor și ale locurilor de transbordare @ro
preferred label: Ostu un pārkraušanas vietu atrašanās vieta un informācija par tām @lv
preferred label: Χωροθέτηση και χαρακτηριστικά λιμένων και σημείων μεταφόρτωσης @el
preferred label: Разположение и характеристики на пристанищата и местата за претоварване @bg
preferred label: Suíomh agus saintréithe calafort agus láithreán trasloingsithe @ga
preferred label: Lokalizácia a charakteristiky prístavov a prekládkových staníc @sk
preferred label: Localización y características de puertos y puntos de transbordo @es
preferred label: Sadamate ja ümberlaadimispunktide asukohad ja tunnused @et
preferred label: A kikötők és átrakásra alkalmas területek helymeghatározása és jellemzői @hu
preferred label: Havnes og omladningssteders beliggenhed og karakteristika @da
preferred label: Lage und Merkmale von Häfen und Umschlagstellen @de
preferred label: Localização e características dos portos e dos terminais de transbordo @pt
preferred label: Lokalizacja i charakterystyka portów i miejsc przeładunkowych @pl
preferred label: Hamnars och omlastningsanläggningars lokalisering och egenskaper @sv
preferred label: Uostų ir krovinių perkrovimo centrų vietos ir savybės @lt
preferred label: Umístění a vlastnosti přístavů a překladišť @cs
preferred label: Plaats en kenmerken van havens en overslaginstallaties @nl
preferred label: Satamien ja uudelleenlastauskeskusten sijainti ja ominaispiirteet @fi
preferred label: Localizzazione e caratteristiche di porti e impianti di trasbordo @it
preferred label: Lokacija in značilnosti pristanišč in dokov za pretovarjanje @sl

Links to the external xml-files with operation times of restricting structures
type: Concept
order: 060217
start date: 2019-07-06
created: 2024-05-21
broader: Inland waterways datasets
definition: data sets as described in Commission Implementing Regulation (EU) 2023/138 of 21 December 2022 laying down a list of specific high-value datasets and the arrangements for their publication and re-use, Annex, Section 6
in scheme: High-value dataset categories
preferred label: Link ai file xml esterni con orari di servizio delle strutture che potrebbero ostacolare il traffico @it
preferred label: Links zu den externen xml-Dateien mit Betriebszeiten einschränkender Infrastrukturen @de
preferred label: Linki do zewnętrznych plików xml zawierających rozkład godzin eksploatacji struktur ograniczających @pl
preferred label: Links til de eksterne xml-filer med driftstider for hæmmende anlæg @da
preferred label: Hiperhivatkozások az áthaladást korlátozó építmények üzemidejét tartalmazó külső XML-fájlokra @hu
preferred label: Enlaces a los ficheros XML externos con tiempos de funcionamiento de estructuras restrictivas @es
preferred label: Poveznice na vanjske datoteke formata XML s radnim vremenom struktura koje ograničavaju promet @hr
preferred label: Links għall-fajls xml esterni bil-ħinijiet ta’ operazzjoni tal-istrutturi ta’ restrizzjoni @mt
preferred label: Links naar de externe XML-bestanden met bedieningstijden van beperkende structuren @nl
preferred label: Връзки към външните файлове xml с работното време на ограничаващите конструкции @bg
preferred label: Länkar till externa xml-filer med driftstider för begränsande strukturer @sv
preferred label: Linkuri către fișierele xml externe cu orele de exploatare a structurilor restrictive @ro
preferred label: Saites uz ārējām xml datnēm ar ierobežojošo struktūru darbības laikiem @lv
preferred label: Prepojenia na externé súbory xml s prevádzkovým časom objektov obmedzujúcich plavbu @sk
preferred label: Ligações aos ficheiros xml externos, com indicação dos horários de funcionamento das estruturas que condicionam o tráfego @pt
preferred label: Σύνδεσμοι προς τα εξωτερικά αρχεία xml με τις ώρες λειτουργίας των περιοριστικών δομών @el
preferred label: Naisc chuig na comhaid xml sheachtracha lena mbaineann réanna oibrithe struchtúr sriantach @ga
preferred label: Liens vers les fichiers XML externes contenant les horaires des structures limitatives @fr
preferred label: Linkit ulkoisiin xml-tiedostoihin, jotka sisältävät rajoittavien rakenteiden käyttöajat @fi
preferred label: Povezave do zunanjih datotek XML s časom obratovanja omejevalnih struktur @sl
preferred label: Odkazy na externí soubory xml s provozními dobami omezujících infrastruktur @cs
preferred label: Nuorodos į išorinius XML failus, kuriuose nurodomas ribojančių struktūrų darbo laikas @lt
preferred label: Väliste xml-failide lingid koos piiravate struktuuride tööaegadega @et

Land use
type: Concept
order: 0212
start date: 2019-07-06
created: 2024-05-17
broader: Earth observation and environment
definition: data sets as described in Commission Implementing Regulation (EU) 2023/138 of 21 December 2022 laying down a list of specific high-value datasets and the arrangements for their publication and re-use, Annex, Section 2
in scheme: High-value dataset categories
preferred label: Využitie územia @sk
preferred label: Korištenje zemljišta @hr
preferred label: Usage des sols @fr
preferred label: Zagospodarowanie przestrzenne @pl
preferred label: Arealanvendelse @da
preferred label: Maakasutus @et
preferred label: Využití území @cs
preferred label: Χρήση γης @el
preferred label: Ползване на земята @bg
preferred label: Utilizzo del territorio @it
preferred label: Uso del suelo @es
preferred label: Úsáid talún @ga
preferred label: Žemės naudojimas @lt
preferred label: Bodennutzung @de
preferred label: Maankäyttö @fi
preferred label: Markanvändning @sv
preferred label: Zemes izmantošana @lv
preferred label: Namenska raba tal @sl
preferred label: Landgebruik @nl
preferred label: Földhasználat @hu
preferred label: Użu tal-art @mt
preferred label: Utilizarea terenului @ro
preferred label: Uso do solo @pt

Short term changes of lock and bridge operating times
type: Concept
order: 060214
start date: 2019-07-06
created: 2024-05-21
broader: Inland waterways datasets
definition: data sets as described in Commission Implementing Regulation (EU) 2023/138 of 21 December 2022 laying down a list of specific high-value datasets and the arrangements for their publication and re-use, Annex, Section 6
in scheme: High-value dataset categories
preferred label: Krátkodobé změny provozních dob plavebních komor a mostů @cs
preferred label: A zsilipek és a hidak üzemidejének ideiglenes változásai @hu
preferred label: Tymczasowe zmiany rozkładu godzin eksploatacji śluz i mostów @pl
preferred label: Krátkodobé zmeny v prevádzkových časoch plavebných komôr a mostov @sk
preferred label: Förändringar på kort sikt av slussarnas och broarnas driftstider @sv
preferred label: Lühiajalised muutused lüüside ja sildade toimimisaegades @et
preferred label: Sulkujen ja siltojen tavanomaisten aukioloaikojen lyhytaikaiset muutokset @fi
preferred label: Bidliet għal żmien qasir fil-ħinijiet ta’ operazzjoni ta’ mgħalaq u ta’ pontijiet @mt
preferred label: Cambios a corto plazo de los horarios de esclusas y puentes @es
preferred label: Changements à court terme des horaires des écluses et des ponts @fr
preferred label: Modificări pe termen scurt ale orelor de exploatare a ecluzelor și podurilor @ro
preferred label: Краткосрочни промени на операционното време на шлюзовете и мостовете @bg
preferred label: Kurzfristige Änderungen der Betriebszeiten von Schleusen und Brücken @de
preferred label: Kortvarige ændringer af driftstider for sluser og broer @da
preferred label: Kratkoročne spremembe časa obratovanja zapornic in mostov @sl
preferred label: Cambiamenti a breve termine degli orari di servizio di chiuse e ponti @it
preferred label: Athruithe gearrthéarmacha ar réanna oibrithe loc agus droichead @ga
preferred label: Kortstondige wijzigingen in de bedieningstijden van sluizen en bruggen @nl
preferred label: Trumpalaikiai šliuzų ir tiltų darbo laiko pasikeitimai @lt
preferred label: Slūžu un tiltu darbības laiku izmaiņas īstermiņā @lv
preferred label: Kratkotrajne promjene radnog vremena prevodnica i mostova @hr
preferred label: Alteração a curto prazo de serviço de eclusas e pontes @pt
preferred label: Βραχυπρόθεσμες αλλαγές των ωρών λειτουργίας κλεισιάδων και γεφυρών @el

Geology
type: Concept
order: 0204
start date: 2019-07-06
created: 2024-05-15
broader: Earth observation and environment
definition: data sets as described in Commission Implementing Regulation (EU) 2023/138 of 21 December 2022 laying down a list of specific high-value datasets and the arrangements for their publication and re-use, Annex, Section 2
in scheme: High-value dataset categories
preferred label: Geologija @sl
preferred label: Геология @bg
preferred label: Γεωλογία @el
preferred label: Géologie @fr
preferred label: Geologie @cs
preferred label: Geologi @da
preferred label: Földtan @hu
preferred label: Geoloogia @et
preferred label: Ģeoloģija @lv
preferred label: Geolaíocht @ga
preferred label: Geologia @fi
preferred label: Geológia @sk
preferred label: Ġeoloġija @mt
preferred label: Geología @es